Discussion:
Build regressions/improvements in v3.5-rc4
(too old to reply)
Geert Uytterhoeven
2012-06-26 19:59:55 UTC
Permalink
Below is the list of build error/warning regressions/improvements in
v3.5-rc4[1] compared to v3.4[2].

Too make this mail fit in the lkml limit, I deleted
- all implicit function declaration error improvements
- 214 lines about __mcount_loc on sparc64
- all warning improvements

Summarized:
- build errors: +220/-576
- build warnings: +696/-454

JFYI, when comparing v3.5-rc4 to v3.5-rc3[3], the summaries are:
- build errors: +11/-219
- build warnings: +344/-203

Note that there may be false regressions, as some logs are incomplete.
Still, they're build errors/warnings.

As I haven't mastered kup yet, there's no verbose summary at
http://www.kernel.org/pub/linux/kernel/people/geert/linux-log/v3.5-rc4.summary.gz

Happy fixing! ;-)

Thanks to the linux-next team for providing the build service.

[1] http://kisskb.ellerman.id.au/kisskb/head/5182/ (all 116 configs)
[2] http://kisskb.ellerman.id.au/kisskb/head/5055/ (115 out of 116 configs)
[3] http://kisskb.ellerman.id.au/kisskb/head/5155/ (all 116 configs)


*** ERRORS ***

220 regressions:
+ arch/cris/arch-v10/kernel/kgdb.c: error: expected string literal before '.' token: => 1274:3
+ arch/cris/arch-v10/kernel/kgdb.c: error: missing terminating " character: => 1359:1, 1370:1, 1273:1, 1457:1
+ arch/h8300/kernel/signal.c: error: expected '=', ',', ';', 'asm' or '__attribute__' before 'void': => 450:8
+ arch/h8300/kernel/signal.c: error: implicit declaration of function 'do_signal' [-Werror=implicit-function-declaration]: => 495:3
+ arch/mips/include/asm/bitops.h: error: static declaration of 'fls' follows non-static declaration: => 615:90
+ arch/sh/include/asm/fixmap.h: error: implicit declaration of function 'BUG_ON' [-Werror=implicit-function-declaration]: => 133:2
+ arch/sh/include/asm/thread_info.h: error: implicit declaration of function 'WARN_ON' [-Werror=implicit-function-declaration]: => 172:2
+ arch/x86/include/asm/paravirt.h: error: implicit declaration of function 'BUG_ON' [-Werror=implicit-function-declaration]: => 25:2
+ arch/x86/include/asm/processor.h: error: implicit declaration of function 'WARN_ON_ONCE' [-Werror=implicit-function-declaration]: => 936:2
+ arch/x86/include/asm/thread_info.h: error: implicit declaration of function 'WARN_ON' [-Werror=implicit-function-declaration]: => 251:2
+ block/blk-cgroup.c: error: implicit declaration of function 'ATOMIC64_INIT' [-Werror=implicit-function-declaration]: => 614:2
+ block/blk-cgroup.c: error: implicit declaration of function 'atomic64_inc_return' [-Werror=implicit-function-declaration]: => 628:2
+ block/blk-cgroup.c: error: initializer element is not constant: => 614:2
+ block/blk-cgroup.c: error: unknown type name 'atomic64_t': => 614:2
+ drivers/block/hd.c: error: implicit declaration of function 'inb_p' [-Werror=implicit-function-declaration]: => 256:2
+ drivers/block/hd.c: error: implicit declaration of function 'outb_p' [-Werror=implicit-function-declaration]: => 297:3
+ drivers/block/paride/bpck.c: error: invalid operands to binary & (have 'void *' and 'int'): => 62:140, 56:140
+ drivers/block/paride/epia.c: error: invalid operands to binary & (have 'void *' and 'int'): => 63:502
+ drivers/block/paride/epia.c: error: invalid operands to binary | (have 'void *' and 'int'): => 64:502
+ drivers/block/paride/kbic.c: error: invalid operands to binary | (have 'void *' and 'int'): => 85:142, 61:142, 91:142, 53:142, 67:142, 57:142
+ drivers/char/ipmi/ipmi_si_intf.c: error: invalid operands to binary << (have 'void *' and 'int'): => 1373:153, 1388:151
+ drivers/char/tpm/tpm.h: error: invalid operands to binary & (have 'void *' and 'int'): => 144:131
+ drivers/extcon/extcon_gpio.c: error: implicit declaration of function 'gpio_free' [-Werror=implicit-function-declaration]: => 136:2
+ drivers/extcon/extcon_gpio.c: error: implicit declaration of function 'gpio_request_one' [-Werror=implicit-function-declaration]: => 110:2
+ drivers/gpu/drm/ast/ast_drv.h: error: implicit declaration of function 'ioread16' [-Werror=implicit-function-declaration]: => 130:108
+ drivers/gpu/drm/ast/ast_drv.h: error: implicit declaration of function 'ioread32' [-Werror=implicit-function-declaration]: => 131:108
+ drivers/gpu/drm/ast/ast_drv.h: error: implicit declaration of function 'ioread8' [-Werror=implicit-function-declaration]: => 129:106
+ drivers/gpu/drm/ast/ast_drv.h: error: implicit declaration of function 'iowrite16' [-Werror=implicit-function-declaration]: => 150:110
+ drivers/gpu/drm/ast/ast_drv.h: error: implicit declaration of function 'iowrite32' [-Werror=implicit-function-declaration]: => 151:110
+ drivers/gpu/drm/ast/ast_drv.h: error: implicit declaration of function 'iowrite8' [-Werror=implicit-function-declaration]: => 149:109
+ drivers/gpu/drm/ast/ast_main.c: error: implicit declaration of function 'pci_iomap' [-Werror=implicit-function-declaration]: => 340:2
+ drivers/gpu/drm/ast/ast_main.c: error: implicit declaration of function 'pci_iounmap' [-Werror=implicit-function-declaration]: => 406:2
+ drivers/gpu/drm/cirrus/cirrus_mode.c: error: implicit declaration of function 'ioread8' [-Werror=implicit-function-declaration]: => 86:2
+ drivers/gpu/drm/cirrus/cirrus_mode.c: error: implicit declaration of function 'iowrite8' [-Werror=implicit-function-declaration]: => 46:3
+ drivers/gpu/drm/mgag200/mgag200_i2c.c: error: implicit declaration of function 'ioread8' [-Werror=implicit-function-declaration]: => 39:2
+ drivers/gpu/drm/mgag200/mgag200_i2c.c: error: implicit declaration of function 'iowrite8' [-Werror=implicit-function-declaration]: => 38:2
+ drivers/gpu/drm/mgag200/mgag200_main.c: error: implicit declaration of function 'ioread16' [-Werror=implicit-function-declaration]: => 103:2
+ drivers/gpu/drm/mgag200/mgag200_main.c: error: implicit declaration of function 'ioread32' [-Werror=implicit-function-declaration]: => 193:3
+ drivers/gpu/drm/mgag200/mgag200_main.c: error: implicit declaration of function 'ioread8' [-Werror=implicit-function-declaration]: => 107:3
+ drivers/gpu/drm/mgag200/mgag200_main.c: error: implicit declaration of function 'iowrite16' [-Werror=implicit-function-declaration]: => 104:2
+ drivers/gpu/drm/mgag200/mgag200_main.c: error: implicit declaration of function 'pci_iomap' [-Werror=implicit-function-declaration]: => 154:2
+ drivers/gpu/drm/mgag200/mgag200_main.c: error: implicit declaration of function 'pci_iounmap' [-Werror=implicit-function-declaration]: => 89:2
+ drivers/gpu/drm/mgag200/mgag200_mode.c: error: implicit declaration of function 'ioread32' [-Werror=implicit-function-declaration]: => 54:3
+ drivers/gpu/drm/mgag200/mgag200_mode.c: error: implicit declaration of function 'ioread8' [-Werror=implicit-function-declaration]: => 70:3
+ drivers/gpu/drm/mgag200/mgag200_mode.c: error: implicit declaration of function 'iowrite32' [-Werror=implicit-function-declaration]: => 994:3
+ drivers/gpu/drm/mgag200/mgag200_mode.c: error: implicit declaration of function 'iowrite8' [-Werror=implicit-function-declaration]: => 38:2
+ drivers/gpu/drm/nouveau/nve0_fifo.c: error: implicit declaration of function 'ioremap_wc' [-Werror=implicit-function-declaration]: => 114:2
+ drivers/gpu/drm/radeon/radeon.h: error: unknown type name 'atomic64_t': => 263:2
+ drivers/gpu/drm/radeon/radeon_fence.c: error: implicit declaration of function 'atomic64_read' [-Werror=implicit-function-declaration]: => 103:2
+ drivers/gpu/drm/radeon/radeon_fence.c: error: implicit declaration of function 'atomic64_set' [-Werror=implicit-function-declaration]: => 553:2
+ drivers/gpu/drm/radeon/radeon_fence.c: error: implicit declaration of function 'atomic64_xchg' [-Werror=implicit-function-declaration]: => 128:2
+ drivers/i2c/busses/i2c-bfin-twi.c: error: 'ANAK' undeclared (first use in this function): => 154:19
+ drivers/i2c/busses/i2c-bfin-twi.c: error: 'BUFRDERR' undeclared (first use in this function): => 158:19
+ drivers/i2c/busses/i2c-bfin-twi.c: error: 'BUFWRERR' undeclared (first use in this function): => 160:19
+ drivers/i2c/busses/i2c-bfin-twi.c: error: 'BUSBUSY' undeclared (first use in this function): => 401:35, 301:35
+ drivers/i2c/busses/i2c-bfin-twi.c: error: 'DNAK' undeclared (first use in this function): => 156:19
+ drivers/i2c/busses/i2c-bfin-twi.c: error: 'FAST' undeclared (first use in this function): => 511:17, 360:18
+ drivers/i2c/busses/i2c-bfin-twi.c: error: 'LOSTARB' undeclared (first use in this function): => 152:19
+ drivers/i2c/busses/i2c-bfin-twi.c: error: 'MCOMP' undeclared (first use in this function): => 189:22, 489:31, 344:31
+ drivers/i2c/busses/i2c-bfin-twi.c: error: 'MDIR' undeclared (first use in this function): => 359:31, 567:32, 102:30
+ drivers/i2c/busses/i2c-bfin-twi.c: error: 'MEN' undeclared (first use in this function): => 358:51, 510:52, 196:33
+ drivers/i2c/busses/i2c-bfin-twi.c: error: 'MERR' undeclared (first use in this function): => 146:23, 489:24, 344:24
+ drivers/i2c/busses/i2c-bfin-twi.c: error: 'RCVSERV' undeclared (first use in this function): => 489:49, 116:23, 344:49
+ drivers/i2c/busses/i2c-bfin-twi.c: error: 'RSTART' undeclared (first use in this function): => 102:37
+ drivers/i2c/busses/i2c-bfin-twi.c: error: 'SCLOVR' undeclared (first use in this function): => 171:29
+ drivers/i2c/busses/i2c-bfin-twi.c: error: 'SDAOVR' undeclared (first use in this function): => 177:28
+ drivers/i2c/busses/i2c-bfin-twi.c: error: 'SDASEN' undeclared (first use in this function): => 168:33
+ drivers/i2c/busses/i2c-bfin-twi.c: error: 'STOP' undeclared (first use in this function): => 105:30
+ drivers/i2c/busses/i2c-bfin-twi.c: error: 'TWI_ENA' undeclared (first use in this function): => 398:30, 624:47, 298:30, 725:45
+ drivers/i2c/busses/i2c-bfin-twi.c: error: 'XMTSERV' undeclared (first use in this function): => 344:39, 489:39, 90:23
+ drivers/i2c/muxes/i2c-mux-gpio.c: error: implicit declaration of function 'gpio_direction_output' [-Werror=implicit-function-declaration]: => 101:3
+ drivers/i2c/muxes/i2c-mux-gpio.c: error: implicit declaration of function 'gpio_free' [-Werror=implicit-function-declaration]: => 130:3
+ drivers/i2c/muxes/i2c-mux-gpio.c: error: implicit declaration of function 'gpio_request' [-Werror=implicit-function-declaration]: => 98:3
+ drivers/infiniband/hw/ocrdma/ocrdma_hw.c: error: implicit declaration of function 'iowrite32' [-Werror=implicit-function-declaration]: => 286:2
+ drivers/infiniband/hw/ocrdma/ocrdma_verbs.c: error: implicit declaration of function 'iowrite32' [-Werror=implicit-function-declaration]: => 1760:2
+ drivers/input/gameport/lightning.c: error: invalid operands to binary & (have 'void *' and 'int'): => 177:136, 141:136, 86:133
+ drivers/input/gameport/ns558.c: error: invalid operands to binary & (have 'void *' and 'int'): => 84:124
+ drivers/input/touchscreen/mk712.c: error: invalid operands to binary | (have 'void *' and 'int'): => 129:136
+ drivers/mfd/lm3533-core.c: error: implicit declaration of function 'gpio_free' [-Werror=implicit-function-declaration]: => 531:3
+ drivers/mfd/lm3533-core.c: error: implicit declaration of function 'gpio_request_one' [-Werror=implicit-function-declaration]: => 498:3
+ drivers/net/cris/eth_v10.c: error: too many arguments to function 'e100rxtx_interrupt': => 1715:2
+ drivers/net/ethernet/broadcom/bnx2.c: error: implicit declaration of function 'pci_iomap' [-Werror=implicit-function-declaration]: => 8037:2
+ drivers/net/ethernet/broadcom/bnx2.c: error: implicit declaration of function 'pci_iounmap' [-Werror=implicit-function-declaration]: => 8342:2
+ drivers/net/ethernet/dec/tulip/dmfe.c: error: implicit declaration of function 'ioread16' [-Werror=implicit-function-declaration]: => 1843:3
+ drivers/net/ethernet/dec/tulip/dmfe.c: error: implicit declaration of function 'ioread32' [-Werror=implicit-function-declaration]: => 809:2
+ drivers/net/ethernet/dec/tulip/dmfe.c: error: implicit declaration of function 'ioread8' [-Werror=implicit-function-declaration]: => 1205:3
+ drivers/net/ethernet/dec/tulip/dmfe.c: error: implicit declaration of function 'iowrite16' [-Werror=implicit-function-declaration]: => 1465:3
+ drivers/net/ethernet/dec/tulip/dmfe.c: error: implicit declaration of function 'iowrite32' [-Werror=implicit-function-declaration]: => 626:2
+ drivers/net/ethernet/dec/tulip/dmfe.c: error: implicit declaration of function 'pci_iomap' [-Werror=implicit-function-declaration]: => 464:2
+ drivers/net/ethernet/dec/tulip/dmfe.c: error: implicit declaration of function 'pci_iounmap' [-Werror=implicit-function-declaration]: => 509:2
+ drivers/net/ethernet/dec/tulip/uli526x.c: error: implicit declaration of function 'ioread32' [-Werror=implicit-function-declaration]: => 396:4
+ drivers/net/ethernet/dec/tulip/uli526x.c: error: implicit declaration of function 'iowrite32' [-Werror=implicit-function-declaration]: => 257:2
+ drivers/net/ethernet/dec/tulip/uli526x.c: error: implicit declaration of function 'pci_iomap' [-Werror=implicit-function-declaration]: => 363:2
+ drivers/net/ethernet/dec/tulip/uli526x.c: error: implicit declaration of function 'pci_iounmap' [-Werror=implicit-function-declaration]: => 420:2
+ drivers/net/ethernet/dec/tulip/xircom_cb.c: error: implicit declaration of function 'ioread32' [-Werror=implicit-function-declaration]: => 340:2
+ drivers/net/ethernet/dec/tulip/xircom_cb.c: error: implicit declaration of function 'ioread8' [-Werror=implicit-function-declaration]: => 980:2
+ drivers/net/ethernet/dec/tulip/xircom_cb.c: error: implicit declaration of function 'iowrite32' [-Werror=implicit-function-declaration]: => 370:2
+ drivers/net/ethernet/dec/tulip/xircom_cb.c: error: implicit declaration of function 'pci_iomap' [-Werror=implicit-function-declaration]: => 258:2
+ drivers/net/ethernet/dec/tulip/xircom_cb.c: error: implicit declaration of function 'pci_iounmap' [-Werror=implicit-function-declaration]: => 293:2
+ drivers/net/ethernet/dlink/de600.c: error: expected expression before 'do': => 146:2, 301:3, 210:3, 150:2, 468:2, 404:2, 208:3, 495:3, 328:2, 138:2, 499:2, 217:3, 417:2, 136:2, 300:3, 464:2, 501:2, 493:2, 206:2, 216:3, 254:4, 350:2, 196:3, 137:2, 405:2, 463:2
+ drivers/net/ethernet/dlink/de620.c: error: invalid operands to binary ^ (have 'void *' and 'int'): => 395:147, 266:147, 371:147
+ drivers/net/ethernet/dlink/dl2k.c: error: implicit declaration of function 'ioread16' [-Werror=implicit-function-declaration]: => 257:2
+ drivers/net/ethernet/dlink/dl2k.c: error: implicit declaration of function 'ioread32' [-Werror=implicit-function-declaration]: => 428:2
+ drivers/net/ethernet/dlink/dl2k.c: error: implicit declaration of function 'ioread8' [-Werror=implicit-function-declaration]: => 385:4
+ drivers/net/ethernet/dlink/dl2k.c: error: implicit declaration of function 'iowrite16' [-Werror=implicit-function-declaration]: => 64:2
+ drivers/net/ethernet/dlink/dl2k.c: error: implicit declaration of function 'iowrite32' [-Werror=implicit-function-declaration]: => 428:2
+ drivers/net/ethernet/dlink/dl2k.c: error: implicit declaration of function 'iowrite8' [-Werror=implicit-function-declaration]: => 385:4
+ drivers/net/ethernet/dlink/dl2k.c: error: implicit declaration of function 'pci_iomap' [-Werror=implicit-function-declaration]: => 150:2
+ drivers/net/ethernet/dlink/dl2k.c: error: implicit declaration of function 'pci_iounmap' [-Werror=implicit-function-declaration]: => 302:2
+ drivers/net/ethernet/emulex/benet/be_main.c: error: implicit declaration of function 'pci_iomap' [-Werror=implicit-function-declaration]: => 3265:2
+ drivers/net/ethernet/emulex/benet/be_main.c: error: implicit declaration of function 'pci_iounmap' [-Werror=implicit-function-declaration]: => 3257:3
+ drivers/net/ethernet/seeq/seeq8005.c: error: invalid operands to binary >> (have 'void *' and 'int'): => 544:161
+ drivers/net/ethernet/seeq/seeq8005.c: error: invalid operands to binary | (have 'void *' and 'int'): => 640:138, 220:138, 661:139, 543:140, 438:139, 671:142, 722:138, 705:140, 700:138, 468:140, 673:138, 672:142, 322:139, 461:140, 502:139
+ drivers/net/ethernet/sis/sis900.c: error: implicit declaration of function 'ioread16' [-Werror=implicit-function-declaration]: => 352:3
+ drivers/net/ethernet/sis/sis900.c: error: implicit declaration of function 'ioread32' [-Werror=implicit-function-declaration]: => 341:2
+ drivers/net/ethernet/sis/sis900.c: error: implicit declaration of function 'iowrite32' [-Werror=implicit-function-declaration]: => 343:2
+ drivers/net/ethernet/sis/sis900.c: error: implicit declaration of function 'iowrite8' [-Werror=implicit-function-declaration]: => 964:3
+ drivers/net/ethernet/sis/sis900.c: error: implicit declaration of function 'pci_iomap' [-Werror=implicit-function-declaration]: => 480:2
+ drivers/net/ethernet/sis/sis900.c: error: implicit declaration of function 'pci_iounmap' [-Werror=implicit-function-declaration]: => 588:2
+ drivers/net/ethernet/smsc/epic100.c: error: implicit declaration of function 'ioread16' [-Werror=implicit-function-declaration]: => 424:3
+ drivers/net/ethernet/smsc/epic100.c: error: implicit declaration of function 'ioread32' [-Werror=implicit-function-declaration]: => 419:3
+ drivers/net/ethernet/smsc/epic100.c: error: implicit declaration of function 'ioread8' [-Werror=implicit-function-declaration]: => 776:3
+ drivers/net/ethernet/smsc/epic100.c: error: implicit declaration of function 'iowrite16' [-Werror=implicit-function-declaration]: => 638:2
+ drivers/net/ethernet/smsc/epic100.c: error: implicit declaration of function 'iowrite32' [-Werror=implicit-function-declaration]: => 410:2
+ drivers/net/ethernet/smsc/epic100.c: error: implicit declaration of function 'pci_iomap' [-Werror=implicit-function-declaration]: => 368:2
+ drivers/net/ethernet/smsc/epic100.c: error: implicit declaration of function 'pci_iounmap' [-Werror=implicit-function-declaration]: => 507:2
+ drivers/net/ethernet/stmicro/stmmac/stmmac_pci.c: error: implicit declaration of function 'pci_iomap' [-Werror=implicit-function-declaration]: => 90:3
+ drivers/net/ethernet/stmicro/stmmac/stmmac_pci.c: error: implicit declaration of function 'pci_iounmap' [-Werror=implicit-function-declaration]: => 142:2
+ drivers/net/ethernet/wiznet/w5100.c: error: implicit declaration of function 'ioread8' [-Werror=implicit-function-declaration]: => 122:2
+ drivers/net/ethernet/wiznet/w5100.c: error: implicit declaration of function 'iowrite8' [-Werror=implicit-function-declaration]: => 128:2
+ drivers/net/ethernet/wiznet/w5100.c: error: implicit declaration of function 'mmiowb' [-Werror=implicit-function-declaration]: => 189:2
+ drivers/net/ethernet/wiznet/w5300.c: error: implicit declaration of function 'ioread16' [-Werror=implicit-function-declaration]: => 118:2
+ drivers/net/ethernet/wiznet/w5300.c: error: implicit declaration of function 'iowrite16' [-Werror=implicit-function-declaration]: => 124:2
+ drivers/net/ethernet/wiznet/w5300.c: error: implicit declaration of function 'mmiowb' [-Werror=implicit-function-declaration]: => 145:2
+ drivers/net/hamradio/baycom_ser_fdx.c: error: invalid operands to binary >> (have 'void *' and 'int'): => 189:152
+ drivers/net/hamradio/baycom_ser_fdx.c: error: invalid operands to binary | (have 'void *' and 'int'): => 329:145, 388:132
+ drivers/net/hamradio/baycom_ser_hdx.c: error: invalid operands to binary | (have 'void *' and 'int'): => 447:132, 209:142
+ drivers/net/hamradio/yam.c: error: invalid operands to binary ^ (have 'void *' and 'int'): => 713:159
+ drivers/net/hamradio/yam.c: error: invalid operands to binary | (have 'void *' and 'int'): => 320:134, 309:134, 317:134, 517:132, 481:142, 336:134
+ drivers/net/hippi/rrunner.c: error: implicit declaration of function 'pci_iomap' [-Werror=implicit-function-declaration]: => 152:2
+ drivers/net/hippi/rrunner.c: error: implicit declaration of function 'pci_iounmap' [-Werror=implicit-function-declaration]: => 213:3
+ drivers/net/irda/bfin_sir.c: error: 'IREN' undeclared (first use in this function): => 161:9, 521:11, 435:18
+ drivers/net/wireless/ipw2x00/ipw2100.c: error: implicit declaration of function 'ioread16' [-Werror=implicit-function-declaration]: => 366:2
+ drivers/net/wireless/ipw2x00/ipw2100.c: error: implicit declaration of function 'ioread32' [-Werror=implicit-function-declaration]: => 349:2
+ drivers/net/wireless/ipw2x00/ipw2100.c: error: implicit declaration of function 'ioread8' [-Werror=implicit-function-declaration]: => 374:2
+ drivers/net/wireless/ipw2x00/ipw2100.c: error: implicit declaration of function 'iowrite16' [-Werror=implicit-function-declaration]: => 382:2
+ drivers/net/wireless/ipw2x00/ipw2100.c: error: implicit declaration of function 'iowrite32' [-Werror=implicit-function-declaration]: => 357:2
+ drivers/net/wireless/ipw2x00/ipw2100.c: error: implicit declaration of function 'iowrite8' [-Werror=implicit-function-declaration]: => 390:2
+ drivers/net/wireless/ipw2x00/ipw2100.c: error: implicit declaration of function 'pci_iomap' [-Werror=implicit-function-declaration]: => 6233:2
+ drivers/net/wireless/ipw2x00/ipw2100.c: error: implicit declaration of function 'pci_iounmap' [-Werror=implicit-function-declaration]: => 6410:2
+ drivers/pci/quirks.c: error: implicit declaration of function 'ioread32' [-Werror=implicit-function-declaration]: => 3154:2
+ drivers/pci/quirks.c: error: implicit declaration of function 'iowrite32' [-Werror=implicit-function-declaration]: => 3144:2
+ drivers/regulator/fixed.c: error: implicit declaration of function 'gpio_request_one' [-Werror=implicit-function-declaration]: => 238:3
+ drivers/regulator/tps62360-regulator.c: error: implicit declaration of function 'gpio_request_one' [-Werror=implicit-function-declaration]: => 452:3
+ drivers/regulator/wm831x-dcdc.c: error: implicit declaration of function 'gpio_request_one' [-Werror=implicit-function-declaration]: => 411:2
+ drivers/scsi/pcmcia/sym53c500_cs.c: error: expected expression before 'do': => 453:4, 434:4, 574:2, 371:2
+ drivers/scsi/qlogicfas408.c: error: expected expression before 'do': => 234:2, 221:2, 312:3, 583:2, 535:2, 324:3, 85:2, 406:2, 316:5, 569:9, 89:3, 230:2, 546:2
+ drivers/staging/ipack/bridges/tpci200.c: error: implicit declaration of function 'ioread16' [-Werror=implicit-function-declaration]: => 81:2
+ drivers/staging/ipack/bridges/tpci200.c: error: implicit declaration of function 'ioread32' [-Werror=implicit-function-declaration]: => 87:2
+ drivers/staging/ipack/bridges/tpci200.c: error: implicit declaration of function 'ioread8' [-Werror=implicit-function-declaration]: => 75:2
+ drivers/staging/ipack/bridges/tpci200.c: error: implicit declaration of function 'iowrite16' [-Werror=implicit-function-declaration]: => 100:2
+ drivers/staging/ipack/bridges/tpci200.c: error: implicit declaration of function 'iowrite32' [-Werror=implicit-function-declaration]: => 107:2
+ drivers/staging/ipack/bridges/tpci200.c: error: implicit declaration of function 'iowrite8' [-Werror=implicit-function-declaration]: => 93:2
+ drivers/staging/ipack/bridges/tpci200.c: error: implicit declaration of function 'kfree' [-Werror=implicit-function-declaration]: => 300:2
+ drivers/staging/ipack/bridges/tpci200.c: error: implicit declaration of function 'kzalloc' [-Werror=implicit-function-declaration]: => 951:2
+ drivers/staging/ipack/bridges/tpci200.c: error: implicit declaration of function 'pci_iounmap' [-Werror=implicit-function-declaration]: => 289:2
+ drivers/staging/speakup/serialio.c: error: invalid operands to binary & (have 'void *' and 'int'): => 52:137
+ drivers/staging/speakup/serialio.c: error: invalid operands to binary >> (have 'void *' and 'int'): => 53:137
+ drivers/staging/speakup/serialio.c: error: invalid operands to binary | (have 'void *' and 'int'): => 51:137, 110:148, 107:149, 58:137
+ drivers/staging/speakup/speakup_apollo.c: error: invalid operands to binary | (have 'void *' and 'int'): => 177:151
+ drivers/staging/wlags49_h2/hcf.c: error: expected expression before 'do': => 3375:4, 3592:3, 4378:3, 1135:3, 1203:3, 3593:3, 4731:3, 3653:3, 704:4, 3802:3, 1150:2, 1209:2, 3645:10, 4178:2, 3699:5, 3007:5, 4033:2, 787:3, 2646:4, 1190:2, 3797:3, 717:3, 2630:3, 4732:3, 703:4, 3582:2, 751:5, 2629:3, 755:5, 3507:3, 1153:2, 750:5, 3057:4, 781:4, 2654:4, 3700:5
+ drivers/staging/wlags49_h25/../wlags49_h2/hcf.c: error: expected expression before 'do': => 3375:4, 3592:3, 4378:3, 1135:3, 1203:3, 3593:3, 4731:3, 3653:3, 704:4, 3802:3, 1150:2, 1209:2, 3645:10, 3699:5, 4033:2, 787:3, 2646:4, 1190:2, 717:3, 2630:3, 4732:3, 703:4, 3582:2, 751:5, 2629:3, 755:5, 3507:3, 1153:2, 750:5, 3057:4, 781:4, 2654:4, 3700:5
+ drivers/usb/chipidea/ci.h: error: implicit declaration of function 'ioread32' [-Werror=implicit-function-declaration]: => 255:2
+ drivers/usb/chipidea/ci.h: error: implicit declaration of function 'iowrite32' [-Werror=implicit-function-declaration]: => 271:2
+ drivers/usb/chipidea/core.c: error: implicit declaration of function 'ioread8' [-Werror=implicit-function-declaration]: => 183:2
+ drivers/video/auo_k190x.c: error: implicit declaration of function 'gpio_direction_output' [-Werror=implicit-function-declaration]: => 831:2
+ drivers/video/auo_k190x.c: error: implicit declaration of function 'gpio_free' [-Werror=implicit-function-declaration]: => 996:2
+ drivers/video/auo_k190x.c: error: implicit declaration of function 'gpio_request' [-Werror=implicit-function-declaration]: => 824:2
+ drivers/video/console/fonts.c: error: #error No fonts configured.: => 71:2
+ drivers/vme/boards/vme_vmivme7805.c: error: implicit declaration of function 'ioread32' [-Werror=implicit-function-declaration]: => 80:2
+ drivers/vme/boards/vme_vmivme7805.c: error: implicit declaration of function 'iowrite32' [-Werror=implicit-function-declaration]: => 77:2
+ drivers/vme/bridges/vme_ca91cx42.c: error: implicit declaration of function 'ioread16' [-Werror=implicit-function-declaration]: => 891:4
+ drivers/vme/bridges/vme_ca91cx42.c: error: implicit declaration of function 'ioread32' [-Werror=implicit-function-declaration]: => 104:2
+ drivers/vme/bridges/vme_ca91cx42.c: error: implicit declaration of function 'ioread8' [-Werror=implicit-function-declaration]: => 880:3
+ drivers/vme/bridges/vme_ca91cx42.c: error: implicit declaration of function 'iowrite16' [-Werror=implicit-function-declaration]: => 945:4
+ drivers/vme/bridges/vme_ca91cx42.c: error: implicit declaration of function 'iowrite32' [-Werror=implicit-function-declaration]: => 193:2
+ drivers/vme/bridges/vme_ca91cx42.c: error: implicit declaration of function 'iowrite8' [-Werror=implicit-function-declaration]: => 934:3
+ drivers/vme/bridges/vme_tsi148.c: error: implicit declaration of function 'ioread16' [-Werror=implicit-function-declaration]: => 1339:2
+ drivers/vme/bridges/vme_tsi148.c: error: implicit declaration of function 'ioread32' [-Werror=implicit-function-declaration]: => 2325:2
+ drivers/vme/bridges/vme_tsi148.c: error: implicit declaration of function 'ioread32be' [-Werror=implicit-function-declaration]: => 131:4
+ drivers/vme/bridges/vme_tsi148.c: error: implicit declaration of function 'ioread8' [-Werror=implicit-function-declaration]: => 237:4
+ drivers/vme/bridges/vme_tsi148.c: error: implicit declaration of function 'iowrite32be' [-Werror=implicit-function-declaration]: => 161:2
+ drivers/watchdog/wm831x_wdt.c: error: implicit declaration of function 'gpio_request_one' [-Werror=implicit-function-declaration]: => 250:4
+ error: No rule to make target arch/cris/arch-v10/drivers/ds1302.o: => N/A
+ error: arch/xtensa/platforms/iss/built-in.o: undefined reference to `__netdev_alloc_skb': => .text+0x60)
+ error: network.c: undefined reference to `__netdev_alloc_skb': => .text+0x4cc)
+ error: of_platform.c: undefined reference to `.pcibios_claim_one_bus': => .devinit.text+0x160)
+ include/asm-generic/bitops/fls64.h: error: static declaration of 'fls64' follows non-static declaration: => 26:121, 18:121
+ include/asm-generic/pgtable.h: error: implicit declaration of function 'BUG' [-Werror=implicit-function-declaration]: => 56:2
+ include/asm-generic/pgtable.h: error: implicit declaration of function 'BUG': => 56
+ include/linux/bitops.h: error: conflicting types for 'fls_long': => 160:95
+ include/linux/gpio.h: error: implicit declaration of function '__gpio_cansleep' [-Werror=implicit-function-declaration]: => 62:2
+ include/linux/gpio.h: error: implicit declaration of function '__gpio_to_irq' [-Werror=implicit-function-declaration]: => 67:2
+ include/linux/gpio.h: error: redefinition of 'gpio_cansleep': => 60:90
+ include/linux/huge_mm.h: error: implicit declaration of function 'BUG' [-Werror=implicit-function-declaration]: => 185:2
+ include/linux/log2.h: error: implicit declaration of function 'fls' [-Werror=implicit-function-declaration]: => 34:2
+ include/linux/log2.h: error: implicit declaration of function 'fls64' [-Werror=implicit-function-declaration]: => 42:2
+ include/linux/log2.h: error: implicit declaration of function 'fls_long' [-Werror=implicit-function-declaration]: => 63:2
+ include/linux/pagemap.h: error: assignment of read-only variable '__gu_val': 448:5, 442:2 => 448:4, 499:3, 508:3, 442:2
+ include/linux/slub_def.h: error: implicit declaration of function 'BUG' [-Werror=implicit-function-declaration]: => 192:2
+ include/linux/thread_info.h: error: implicit declaration of function 'WARN_ON': => 129
+ kernel/sys.c: error: 'mmap_min_addr' undeclared (first use in this function): => 1864:34
+ net/mac80211/ieee80211_i.h: error: field 'trig' has incomplete type: => 787:21
+ net/mac80211/led.c: error: 'struct led_classdev' has no member named 'trig_list': => 278:411, 278:352, 278:59, 214:352, 214:411, 214:160, 278:319, 214:223, 214:319, 278:160, 214:59, 278:223
+ net/mac80211/led.c: error: dereferencing pointer to incomplete type: => 74:16, 83:16, 101:19, 92:19
+ net/mac80211/led.c: error: implicit declaration of function 'led_trigger_register' [-Werror=implicit-function-declaration]: => 75:3
+ net/mac80211/led.c: error: implicit declaration of function 'led_trigger_unregister' [-Werror=implicit-function-declaration]: => 119:3
+ net/mac80211/led.c: error: invalid application of 'sizeof' to incomplete type 'struct led_trigger' : => 90:36, 72:33, 99:36, 81:33
+ security/security.c: error: 'BDI_CAP_EXEC_MAP' undeclared (first use in this function): => 688:16
+ security/security.c: error: dereferencing pointer to incomplete type: => 687:36

576 improvements:
- drivers/media/video/uvc/uvc_queue.c: error: 'buf' undeclared (first use in this function): 263:23 =>
- drivers/media/video/uvc/uvc_queue.c: error: 'struct uvc_video_queue' has no member named 'buffer': 255:18 =>
- drivers/media/video/uvc/uvc_queue.c: error: 'struct uvc_video_queue' has no member named 'count': 259:16, 254:23 =>
- drivers/media/video/uvc/uvc_queue.c: error: 'struct vb2_buffer' has no member named 'm': 256:19 =>
- error: arch/xtensa/platforms/iss/built-in.o: undefined reference to `dev_alloc_skb': .text+0x60) =>
- error: kernel/built-in.o: undefined reference to `_sdata': .text+0x8c0), .text+0x84c) =>
- error: network.c: undefined reference to `dev_alloc_skb': .text+0x4c8) =>
- error: via-pmu-event.c: undefined reference to `.input_allocate_device': .init.text+0x8aa4) =>
- error: via-pmu-event.c: undefined reference to `.input_free_device': .init.text+0x8b68) =>
- error: via-pmu-event.c: undefined reference to `.input_register_device': .init.text+0x8b54) =>
- error: vsprintf.c: relocation truncated to fit: R_AVR32_9UW_PCREL against `.text'+9e4: (.text+0x7da) =>
- error: vsprintf.c: relocation truncated to fit: R_AVR32_9UW_PCREL against `.text'+9e8: (.text+0x7ea) =>
- include/linux/sh_pfc.h: error: field 'chip' has incomplete type: 121:19 =>
- include/linux/types.h: error: unknown type name '__kernel_caddr_t': 88:1 =>
- include/linux/types.h: error: unknown type name '__kernel_clock_t': 83:1 =>
- include/linux/types.h: error: unknown type name '__kernel_clockid_t': 35:1 =>
- include/linux/types.h: error: unknown type name '__kernel_daddr_t': 242:2, 31:1 =>
- include/linux/types.h: error: unknown type name '__kernel_gid16_t': 43:1 =>
- include/linux/types.h: error: unknown type name '__kernel_gid32_t': 41:1 =>
- include/linux/types.h: error: unknown type name '__kernel_ino_t': 25:1, 243:2 =>
- include/linux/types.h: error: unknown type name '__kernel_loff_t': 54:1 =>
- include/linux/types.h: error: unknown type name '__kernel_off_t': 29:1 =>
- include/linux/types.h: error: unknown type name '__kernel_old_gid_t': 50:1 =>
- include/linux/types.h: error: unknown type name '__kernel_old_uid_t': 49:1 =>
- include/linux/types.h: error: unknown type name '__kernel_pid_t': 30:1 =>
- include/linux/types.h: error: unknown type name '__kernel_suseconds_t': 33:1 =>
- include/linux/types.h: error: unknown type name '__kernel_time_t': 78:1 =>
- include/linux/types.h: error: unknown type name '__kernel_timer_t': 34:1 =>
- include/linux/types.h: error: unknown type name '__kernel_uid16_t': 42:1 =>
- include/linux/types.h: error: unknown type name '__kernel_uid32_t': 40:1 =>


*** WARNINGS ***

696 regressions:
+ arch/blackfin/include/asm/bfin_serial.h: warning: "get_lsr_cache" redefined [enabled by default]: => 383:0
+ arch/blackfin/include/asm/bfin_serial.h: warning: "port_membase" redefined [enabled by default]: => 270:0
+ arch/blackfin/include/asm/bfin_serial.h: warning: "put_lsr_cache" redefined [enabled by default]: => 384:0
+ arch/blackfin/include/asm/bfin_twi.h: warning: "ANOMALY_05001001" is not defined [-Wundef]: => 87:6
+ arch/cris/arch-v10/drivers/axisflashmap.c: warning: format '%x' expects argument of type 'unsigned int', but argument 3 has type 'uint64_t' [-Wformat]: => 350:11, 286:10, 368:10
+ arch/cris/arch-v10/drivers/axisflashmap.c: warning: format '%x' expects argument of type 'unsigned int', but argument 4 has type 'uint64_t' [-Wformat]: => 350:11, 368:10
+ arch/cris/arch-v10/drivers/sync_serial.c: warning: passing argument 1 of 'memcpy' discards 'volatile' qualifier from pointer target type [enabled by default]: => 1342:6, 1352:6
+ arch/cris/arch-v10/drivers/sync_serial.c: warning: passing argument 1 of 'virt_to_phys' discards 'const' qualifier from pointer target type [enabled by default]: => 1223:2
+ arch/cris/arch-v10/kernel/kgdb.c: warning: 'copy_registers' defined but not used [-Wunused-function]: => 508:1
+ arch/cris/arch-v10/kernel/kgdb.c: warning: 'copy_registers_from_stack' declared 'static' but never defined [-Wunused-function]: => 255:13
+ arch/cris/arch-v10/kernel/kgdb.c: warning: 'copy_registers_to_stack' declared 'static' but never defined [-Wunused-function]: => 259:13
+ arch/cris/arch-v10/kernel/kgdb.c: warning: 'current_thread_c' defined but not used [-Wunused-variable]: => 425:12
+ arch/cris/arch-v10/kernel/kgdb.c: warning: 'current_thread_g' defined but not used [-Wunused-variable]: => 426:12
+ arch/cris/arch-v10/kernel/kgdb.c: warning: 'do_printk' defined but not used [-Wunused-variable]: => 679:12
+ arch/cris/arch-v10/kernel/kgdb.c: warning: 'handle_exception' defined but not used [-Wunused-function]: => 924:1
+ arch/cris/arch-v10/kernel/kgdb.c: warning: 'is_dyn_brkp' defined but not used [-Wunused-variable]: => 442:22
+ arch/cris/arch-v10/kernel/kgdb.c: warning: 'reg_g' defined but not used [-Wunused-variable]: => 430:18
+ arch/cris/arch-v10/kernel/kgdb.c: warning: 'write_stack_register' declared 'static' but never defined [-Wunused-function]: => 267:12
+ arch/cris/arch-v10/kernel/kgdb.c: warning: missing terminating " character [enabled by default]: => 1359:1, 1273:6, 1457:1, 1370:6
+ arch/cris/arch-v32/drivers/axisflashmap.c: warning: ISO C90 forbids mixed declarations and code [-Wdeclaration-after-statement]: => 397:3, 523:2
+ arch/cris/arch-v32/drivers/axisflashmap.c: warning: cast to pointer from integer of different size [-Wint-to-pointer-cast]: => 586:8
+ arch/cris/arch-v32/drivers/axisflashmap.c: warning: format '%x' expects argument of type 'unsigned int', but argument 3 has type 'uint64_t' [-Wformat]: => 336:10
+ arch/cris/arch-v32/kernel/debugport.c: warning: ISO C90 forbids mixed declarations and code [-Wdeclaration-after-statement]: => 122:2
+ arch/cris/arch-v32/kernel/fasttimer.c: warning: ISO C90 forbids mixed declarations and code [-Wdeclaration-after-statement]: => 352:2
+ arch/cris/arch-v32/mach-fs/pinmux.c: warning: ISO C90 forbids mixed declarations and code [-Wdeclaration-after-statement]: => 225:2, 97:2
+ arch/cris/arch-v32/mm/intmem.c: warning: comparison of distinct pointer types lacks a cast [enabled by default]: => 116:14, 123:14
+ arch/cris/arch-v32/mm/intmem.c: warning: initialization from incompatible pointer type [enabled by default]: => 149:133
+ arch/cris/mm/fault.c: warning: ISO C90 forbids mixed declarations and code [-Wdeclaration-after-statement]: => 227:3
+ arch/h8300/kernel/signal.c: warning: 'handle_signal' defined but not used [-Wunused-function]: => 410:1
+ arch/m32r/kernel/signal.c: warning: 'return' with a value, in function returning void [enabled by default]: => 289:6
+ arch/sh/kernel/cpu/sh4a/clock-sh7343.c: warning: 'sh_clk_mstp32_register' is deprecated (declared at /scratch/kisskb/src/include/linux/sh_clk.h:138) [-Wdeprecated-declarations]: => 286:3
+ arch/sh/kernel/cpu/sh4a/clock-sh7722.c: warning: 'sh_clk_mstp32_register' is deprecated (declared at /scratch/kisskb/src/include/linux/sh_clk.h:138) [-Wdeprecated-declarations]: => 264:3
+ arch/sh/kernel/cpu/sh4a/clock-sh7723.c: warning: 'sh_clk_mstp32_register' is deprecated (declared at /scratch/kisskb/src/include/linux/sh_clk.h:138) [-Wdeprecated-declarations]: => 314:3
+ arch/sh/kernel/cpu/sh4a/clock-sh7785.c: warning: 'sh_clk_mstp32_register' is deprecated (declared at /scratch/kisskb/src/include/linux/sh_clk.h:138) [-Wdeprecated-declarations]: => 178:3
+ arch/sh/kernel/cpu/sh4a/clock-shx3.c: warning: 'sh_clk_mstp32_register' is deprecated (declared at /scratch/kisskb/src/include/linux/sh_clk.h:138) [-Wdeprecated-declarations]: => 152:3
+ arch/um/defconfig: warning: symbol value 'm' invalid for BLK_CGROUP: => 166
+ arch/x86/kernel/cpu/perf_event_amd_ibs.c: warning: 'config' may be used uninitialized in this function [-Wuninitialized]: => 248:11
+ arch/x86/kernel/dumpstack_64.c: warning: 'id' may be used uninitialized in this function [-Wuninitialized]: => 153:350
+ block/blk-cgroup.c: warning: unused variable 'q' [-Wunused-variable]: => 248:24
+ block/blk-merge.c: warning: 'bbio' may be used uninitialized in this function [-Wuninitialized]: => 65:44
+ block/blk-throttle.c: warning: value computed is not used [-Wunused-value]: => 1035:3, 1036:3, 840:3
+ block/bsg.c: warning: 'rw' may be used uninitialized in this function [-Wuninitialized]: => 273:5
+ drivers/acpi/sleep.c: warning: 'pwr_btn_event_pending' defined but not used [-Wunused-variable]: => 60:13
+ drivers/base/regmap/regmap.c: warning: 'ret' may be used uninitialized in this function [-Wuninitialized]: 744:2 => 1062:9, 882:6
+ drivers/block/hd.c: warning: statement with no effect [-Wunused-value]: => 467:2
+ drivers/block/paride/ppc6lnx.c: warning: statement with no effect [-Wunused-value]: => 522:4
+ drivers/bluetooth/bluecard_cs.c: warning: unused variable 'iobase' [-Wunused-variable]: => 644:15, 178:15, 822:15, 624:15, 161:15
+ drivers/bluetooth/btuart_cs.c: warning: unused variable 'iobase' [-Wunused-variable]: => 541:15, 474:15
+ drivers/bluetooth/dtl1_cs.c: warning: unused variable 'iobase' [-Wunused-variable]: => 524:15, 454:15
+ drivers/char/ipmi/ipmi_si_intf.c: warning: unused variable 'addr' [-Wunused-variable]: => 1386:15, 1371:15, 1356:15
+ drivers/char/pcmcia/cm4000_cs.c: warning: unused variable 'iobase' [-Wunused-variable]: => 1402:15, 423:15
+ drivers/char/pcmcia/cm4040_cs.c: warning: unused variable 'iobase' [-Wunused-variable]: => 171:6, 321:6
+ drivers/char/raw.c: warning: 'dev' may be used uninitialized in this function [-Wuninitialized]: => 231:21
+ drivers/char/tpm/tpm.c: warning: format '%zd' expects argument of type 'signed size_t', but argument 3 has type 'ssize_t' [-Wformat]: => 404:4, 437:4
+ drivers/char/tpm/tpm_atmel.c: warning: 'base' may be used uninitialized in this function [-Wuninitialized]: => 233:19
+ drivers/gpu/drm/ast/ast_main.c: warning: assignment makes pointer from integer without a cast [enabled by default]: => 345:14, 340:12
+ drivers/gpu/drm/mgag200/mgag200_main.c: warning: assignment makes pointer from integer without a cast [enabled by default]: => 154:6, 187:14
+ drivers/gpu/drm/nouveau/nv40_grctx.c: warning: the frame size of 1184 bytes is larger than 1024 bytes [-Wframe-larger-than=]: => 690:1
+ drivers/gpu/drm/nouveau/nve0_fifo.c: warning: assignment makes pointer from integer without a cast [enabled by default]: => 114:13
+ drivers/hwmon/f71882fg.c: warning: 'address' may be used uninitialized in this function [-Wuninitialized]: => 2685:27
+ drivers/hwmon/pc87427.c: warning: unused variable 'iobase' [-Wunused-variable]: => 620:6, 565:6, 431:6
+ drivers/hwmon/sch56xx-common.c: warning: 'address' may be used uninitialized in this function [-Wuninitialized]: => 606:27
+ drivers/hwmon/sch56xx-common.c: warning: 'name' may be used uninitialized in this function [-Wuninitialized]: => 606:2
+ drivers/i2c/busses/i2c-designware-platdrv.c: warning: 'dw_i2c_resume' defined but not used [-Wunused-function]: => 213:12
+ drivers/i2c/busses/i2c-designware-platdrv.c: warning: 'dw_i2c_suspend' defined but not used [-Wunused-function]: => 203:12
+ drivers/ide/ide-floppy.c: warning: 'pc' may be used uninitialized in this function [-Wuninitialized]: => 296:2
+ drivers/ide/ide-io-std.c: warning: statement with no effect [-Wunused-value]: => 201:3, 186:4
+ drivers/input/gameport/lightning.c: warning: unused variable 'l4' [-Wunused-variable]: => 78:13
+ drivers/isdn/hisax/avm_pci.c: warning: unused variable 'idx' [-Wunused-variable]: => 249:9, 145:18, 114:17, 80:18, 125:17, 134:18, 91:18
+ drivers/isdn/i4l/isdn_common.c: warning: unused variable 's' [-Wunused-variable]: => 1278:8
+ drivers/leds/leds-ot200.c: warning: 'val' may be used uninitialized in this function [-Wuninitialized]: => 112:8
+ drivers/media/dvb/frontends/cx24110.c: warning: value computed is not used [-Wunused-value]: => 520:40
+ drivers/mfd/da9052-core.c: warning: unused variable 'desc' [-Wunused-variable]: => 775:19
+ drivers/mfd/tps6586x.c: warning: cast from pointer to integer of different size [-Wpointer-to-int-cast]: => 531:16
+ drivers/mfd/tps65910.c: warning: cast from pointer to integer of different size [-Wpointer-to-int-cast]: => 157:14
+ drivers/misc/lkdtm.c: warning: the frame size of 1028 bytes is larger than 1024 bytes [-Wframe-larger-than=]: => 276:1
+ drivers/mtd/chips/cfi_cmdset_0001.c: warning: the frame size of 1484 bytes is larger than 1024 bytes [-Wframe-larger-than=]: => 1797:1
+ drivers/mtd/chips/cfi_cmdset_0020.c: warning: the frame size of 1224 bytes is larger than 1024 bytes [-Wframe-larger-than=]: => 420:1
+ drivers/mtd/chips/cfi_cmdset_0020.c: warning: the frame size of 1472 bytes is larger than 1024 bytes [-Wframe-larger-than=]: => 975:1
+ drivers/mtd/chips/cfi_cmdset_0020.c: warning: the frame size of 1764 bytes is larger than 1024 bytes [-Wframe-larger-than=]: => 654:1
+ drivers/mtd/ftl.c: warning: passing argument 4 of 'mtd_read' from incompatible pointer type [enabled by default]: => 527:28, 228:24, 294:24, 490:24
+ drivers/mtd/ftl.c: warning: passing argument 4 of 'mtd_write' from incompatible pointer type [enabled by default]: => 557:21, 535:29, 442:25, 566:21, 426:21, 507:21
+ drivers/mtd/maps/latch-addr-flash.c: warning: 'latch_addr_flash_remove' defined but not used [-Wunused-function]: => 97:12
+ drivers/net/arcnet/com20020.c: warning: unused variable 'ioaddr' [-Wunused-variable]: => 327:6, 63:6, 295:8, 77:6, 310:6
+ drivers/net/arcnet/com20020.c: warning: unused variable 'ofs' [-Wunused-variable]: => 77:31, 63:31
+ drivers/net/arcnet/com20020_cs.c: warning: unused variable 'ioaddr' [-Wunused-variable]: => 310:7
+ drivers/net/arcnet/com20020_cs.c: warning: unused variable 'lp' [-Wunused-variable]: => 311:24
+ drivers/net/arcnet/com90io.c: warning: unused variable 'ioaddr' [-Wunused-variable]: => 420:6, 325:8, 132:6, 341:8, 237:6
+ drivers/net/arcnet/com90xx.c: warning: unused variable 'ioaddr' [-Wunused-variable]: => 574:8, 558:8
+ drivers/net/can/cc770/cc770_isa.c: warning: unused variable 'base' [-Wunused-variable]: => 160:16
+ drivers/net/can/sja1000/sja1000_isa.c: warning: unused variable 'base' [-Wunused-variable]: => 114:16
+ drivers/net/ethernet/3com/3c574_cs.c: warning: unused variable 'dataval' [-Wunused-variable]: => 556:7, 580:7
+ drivers/net/ethernet/3com/3c574_cs.c: warning: unused variable 'ioaddr' [-Wunused-variable]: => 1096:15, 1119:15, 699:15
+ drivers/net/ethernet/3com/3c574_cs.c: warning: unused variable 'mdio_addr' [-Wunused-variable]: => 535:15, 572:15
+ drivers/net/ethernet/3com/3c589_cs.c: warning: unused variable 'ioaddr' [-Wunused-variable]: => 849:18, 519:18, 392:18
+ drivers/net/ethernet/8390/axnet_cs.c: warning: unused variable 'dat' [-Wunused-variable]: => 435:6, 454:6
+ drivers/net/ethernet/8390/axnet_cs.c: warning: unused variable 'e8390_base' [-Wunused-variable]: => 1587:7, 975:7
+ drivers/net/ethernet/8390/axnet_cs.c: warning: unused variable 'endcfg' [-Wunused-variable]: => 1649:6
+ drivers/net/ethernet/8390/axnet_cs.c: warning: unused variable 'info' [-Wunused-variable]: => 1473:15
+ drivers/net/ethernet/8390/axnet_cs.c: warning: unused variable 'nic_base' [-Wunused-variable]: => 634:18, 673:18, 471:18
+ drivers/net/ethernet/8390/lib8390.c: warning: unused variable 'e8390_base' [-Wunused-variable]: => 896:16, 303:16
+ drivers/net/ethernet/8390/lib8390.c: warning: unused variable 'endcfg' [-Wunused-variable]: => 1007:6
+ drivers/net/ethernet/8390/pcnet_cs.c: warning: unused variable 'dat' [-Wunused-variable]: => 711:6, 730:6
+ drivers/net/ethernet/8390/pcnet_cs.c: warning: unused variable 'dataval' [-Wunused-variable]: => 768:8
+ drivers/net/ethernet/8390/pcnet_cs.c: warning: unused variable 'ee_addr' [-Wunused-variable]: => 794:15
+ drivers/net/ethernet/8390/pcnet_cs.c: warning: unused variable 'mask' [-Wunused-variable]: => 726:12, 707:24, 697:15
+ drivers/net/ethernet/8390/pcnet_cs.c: warning: unused variable 'nic_base' [-Wunused-variable]: => 1128:18, 901:18
+ drivers/net/ethernet/amd/nmclan_cs.c: warning: unused variable 'ioaddr' [-Wunused-variable]: => 863:16, 781:16, 804:16
+ drivers/net/ethernet/broadcom/bnx2.c: warning: assignment makes pointer from integer without a cast [enabled by default]: => 8037:14
+ drivers/net/ethernet/dec/tulip/dmfe.c: warning: assignment makes pointer from integer without a cast [enabled by default]: => 464:13
+ drivers/net/ethernet/dec/tulip/uli526x.c: warning: assignment makes pointer from integer without a cast [enabled by default]: => 363:9
+ drivers/net/ethernet/dec/tulip/xircom_cb.c: warning: assignment makes pointer from integer without a cast [enabled by default]: => 258:18
+ drivers/net/ethernet/dlink/de620.c: warning: unused variable 'dflip' [-Wunused-variable]: => 337:7, 297:7
+ drivers/net/ethernet/dlink/de620.c: warning: unused variable 'uflip' [-Wunused-variable]: => 296:7, 336:7
+ drivers/net/ethernet/dlink/dl2k.c: warning: assignment makes pointer from integer without a cast [enabled by default]: => 150:9
+ drivers/net/ethernet/emulex/benet/be_main.c: warning: assignment makes pointer from integer without a cast [enabled by default]: => 3265:7
+ drivers/net/ethernet/fujitsu/fmvj18x_cs.c: warning: unused variable 'buf' [-Wunused-variable]: => 832:17
+ drivers/net/ethernet/fujitsu/fmvj18x_cs.c: warning: unused variable 'ioaddr' [-Wunused-variable]: => 819:18, 1103:18
+ drivers/net/ethernet/fujitsu/fmvj18x_cs.c: warning: unused variable 'saved_config_0' [-Wunused-variable]: => 1144:9
+ drivers/net/ethernet/seeq/seeq8005.c: warning: statement with no effect [-Wunused-value]: => 559:4
+ drivers/net/ethernet/seeq/seeq8005.c: warning: unused variable 'ioaddr' [-Wunused-variable]: => 586:6
+ drivers/net/ethernet/seeq/seeq8005.c: warning: unused variable 'transmit_ptr' [-Wunused-variable]: => 692:6
+ drivers/net/ethernet/sis/sis900.c: warning: assignment makes pointer from integer without a cast [enabled by default]: => 480:9
+ drivers/net/ethernet/smsc/epic100.c: warning: assignment makes pointer from integer without a cast [enabled by default]: => 368:9
+ drivers/net/ethernet/smsc/smc91c92_cs.c: warning: unused variable 'buf' [-Wunused-variable]: => 1155:10
+ drivers/net/ethernet/smsc/smc91c92_cs.c: warning: unused variable 'dat' [-Wunused-variable]: => 994:6, 1014:6
+ drivers/net/ethernet/smsc/smc91c92_cs.c: warning: unused variable 'ioaddr' [-Wunused-variable]: => 1642:18, 1549:18
+ drivers/net/ethernet/smsc/smc91c92_cs.c: warning: unused variable 'packet_no' [-Wunused-variable]: => 1275:9
+ drivers/net/ethernet/smsc/smc91c92_cs.c: warning: unused variable 'saved_bank' [-Wunused-variable]: => 1919:6, 1957:6, 1974:7, 1938:6
+ drivers/net/ethernet/smsc/smc91c92_cs.c: warning: unused variable 'saved_packet' [-Wunused-variable]: => 1274:9
+ drivers/net/ethernet/smsc/smc91c92_cs.c: warning: unused variable 'smc' [-Wunused-variable]: 959:23 => 1314:25, 959:23
+ drivers/net/ethernet/stmicro/stmmac/stmmac_pci.c: warning: assignment makes pointer from integer without a cast [enabled by default]: => 90:8
+ drivers/net/ethernet/wiznet/w5100.c: warning: 'w5100_resume' defined but not used [-Wunused-function]: => 777:12
+ drivers/net/ethernet/wiznet/w5100.c: warning: 'w5100_suspend' defined but not used [-Wunused-function]: => 762:12
+ drivers/net/ethernet/wiznet/w5300.c: warning: 'w5300_resume' defined but not used [-Wunused-function]: => 689:12
+ drivers/net/ethernet/wiznet/w5300.c: warning: 'w5300_suspend' defined but not used [-Wunused-function]: => 674:12
+ drivers/net/ethernet/xircom/xirc2ps_cs.c: warning: unused variable 'ioaddr' [-Wunused-variable]: => 1458:18, 1718:18, 1706:18, 1281:15
+ drivers/net/hamradio/baycom_ser_fdx.c: warning: statement with no effect [-Wunused-value]: => 308:4, 396:2, 397:2, 312:4
+ drivers/net/hamradio/baycom_ser_fdx.c: warning: suggest explicit braces to avoid ambiguous 'else' [-Wparentheses]: => 328:7
+ drivers/net/hamradio/baycom_ser_hdx.c: warning: statement with no effect [-Wunused-value]: => 414:4, 397:4, 455:2, 456:2, 393:4
+ drivers/net/hamradio/yam.c: warning: statement with no effect [-Wunused-value]: => 526:2, 907:3, 314:2, 315:2, 490:2, 525:2, 491:2
+ drivers/net/hamradio/yam.c: warning: unused variable 'divisor' [-Wunused-variable]: => 478:6
+ drivers/net/hippi/rrunner.c: warning: assignment makes pointer from integer without a cast [enabled by default]: => 152:15
+ drivers/net/phy/phy_device.c: warning: 'phy_id' may be used uninitialized in this function [-Wuninitialized]: => 256:25
+ drivers/net/plip/plip.c: warning: 'lbuf' may be used uninitialized in this function [-Wuninitialized]: => 825:72
+ drivers/net/wimax/i2400m/control.c: warning: format '%zu' expects argument of type 'size_t', but argument 4 has type 'ssize_t' [-Wformat]: => 134:10, 239:6
+ drivers/net/wimax/i2400m/control.c: warning: format '%zu' expects argument of type 'size_t', but argument 5 has type 'ssize_t' [-Wformat]: => 239:6
+ drivers/net/wimax/i2400m/usb-fw.c: warning: format '%zd' expects argument of type 'signed size_t', but argument 4 has type 'ssize_t' [-Wformat]: => 210:4
+ drivers/net/wimax/i2400m/usb-fw.c: warning: format '%zd' expects argument of type 'signed size_t', but argument 8 has type 'ssize_t' [-Wformat]: => 222:2
+ drivers/net/wimax/i2400m/usb-fw.c: warning: format '%zu' expects argument of type 'size_t', but argument 4 has type 'ssize_t' [-Wformat]: => 215:4
+ drivers/net/wireless/ath/ath6kl/htc_pipe.c: warning: integer overflow in expression [-Woverflow]: => 1282:26, 1282:227
+ drivers/net/wireless/ath/carl9170/fwcmd.h: warning: 'packed' attribute ignored for field of type 'struct <anonymous>[]' [-Wattributes]: => 123:2
+ drivers/net/wireless/ath/carl9170/mac.c: warning: 'power' may be used uninitialized in this function [-Wuninitialized]: 509:10 => 509:10, 509:122
+ drivers/net/wireless/ath/carl9170/rx.c: warning: 'head' may be used uninitialized in this function [-Wuninitialized]: 730:6 => 730:6, 730:48
+ drivers/net/wireless/brcm80211/brcmsmac/aiutils.c: warning: 'w' may be used uninitialized in this function [-Wuninitialized]: => 823:9
+ drivers/net/wireless/hostap/hostap_cs.c: warning: unused variable 'dev' [-Wunused-variable]: => 247:21
+ drivers/net/wireless/ipw2x00/ipw2100.c: warning: assignment makes pointer from integer without a cast [enabled by default]: => 6233:9
+ drivers/net/wireless/p54/lmac.h: warning: 'packed' attribute ignored for field of type 'struct <anonymous>[3]' [-Wattributes]: => 377:2
+ drivers/net/wireless/wl3501_cs.c: warning: 'addr' may be used uninitialized in this function [-Wuninitialized]: => 805:23
+ drivers/net/wireless/wl3501_cs.c: warning: 'implemented' may be used uninitialized in this function [-Wuninitialized]: => 1765:5
+ drivers/net/wireless/wl3501_cs.c: warning: 'len_keys' may be used uninitialized in this function [-Wuninitialized]: => 1783:11
+ drivers/net/wireless/wl3501_cs.c: warning: 'next' may be used uninitialized in this function [-Wuninitialized]: => 343:24
+ drivers/net/wireless/wl3501_cs.c: warning: 'pwr_state' may be used uninitialized in this function [-Wuninitialized]: => 1802:25
+ drivers/net/wireless/wl3501_cs.c: warning: 'restricted' may be used uninitialized in this function [-Wuninitialized]: => 1773:23
+ drivers/net/wireless/wl3501_cs.c: warning: 'retry' may be used uninitialized in this function [-Wuninitialized]: => 1748:20
+ drivers/net/wireless/wl3501_cs.c: warning: 'rssi' is used uninitialized in this function [-Wuninitialized]: => 951:34
+ drivers/net/wireless/wl3501_cs.c: warning: 'sig_id' may be used uninitialized in this function [-Wuninitialized]: => 1046:2
+ drivers/net/wireless/wl3501_cs.c: warning: 'threshold' may be used uninitialized in this function [-Wuninitialized]: => 1698:20, 1682:19
+ drivers/net/wireless/wl3501_cs.c: warning: 'tmp' is used uninitialized in this function [-Wuninitialized]: => 818:13
+ drivers/net/wireless/wl3501_cs.c: warning: 'tmp' may be used uninitialized in this function [-Wuninitialized]: => 802:6
+ drivers/net/wireless/wl3501_cs.c: warning: 'txpow' may be used uninitialized in this function [-Wuninitialized]: => 1715:23
+ drivers/net/wireless/wl3501_cs.c: warning: 'value' may be used uninitialized in this function [-Wuninitialized]: => 1379:24
+ drivers/net/wireless/wl3501_cs.c: warning: unused variable 'new' [-Wunused-variable]: => 721:5, 738:5
+ drivers/parport/parport_pc.c: warning: unused variable 'fifo' [-Wunused-variable]: => 477:12
+ drivers/pci/quirks.c: warning: assignment makes pointer from integer without a cast [enabled by default]: => 3140:12
+ drivers/platform/x86/samsung-laptop.c: warning: 'loca' may be used uninitialized in this function [-Wuninitialized]: => 1357:26
+ drivers/regulator/tps62360-regulator.c: warning: cast from pointer to integer of different size [-Wpointer-to-int-cast]: => 384:13
+ drivers/scsi/pcmcia/sym53c500_cs.c: warning: unused variable 'port_base' [-Wunused-variable]: => 553:6
+ drivers/scsi/qla4xxx/ql4_nx.c: warning: format '%lx' expects argument of type 'long unsigned int', but argument 5 has type 'uint32_t' [-Wformat]: => 1867:2
+ drivers/scsi/qlogicfas408.c: warning: 'qlcfg5' defined but not used [-Wunused-variable]: => 63:12
+ drivers/scsi/qlogicfas408.c: warning: 'qlcfg6' defined but not used [-Wunused-variable]: => 64:12
+ drivers/scsi/qlogicfas408.c: warning: 'qlcfg7' defined but not used [-Wunused-variable]: => 65:12
+ drivers/scsi/qlogicfas408.c: warning: 'qlcfg8' defined but not used [-Wunused-variable]: => 66:12
+ drivers/scsi/qlogicfas408.c: warning: 'qlcfg9' defined but not used [-Wunused-variable]: => 67:12
+ drivers/scsi/qlogicfas408.c: warning: 'qlcfgc' defined but not used [-Wunused-variable]: => 68:12
+ drivers/scsi/qlogicfas408.c: warning: unused variable 'int_type' [-Wunused-variable]: => 271:6, 216:6, 82:6, 581:6
+ drivers/scsi/qlogicfas408.c: warning: unused variable 'qbase' [-Wunused-variable]: => 580:6
+ drivers/staging/bcm/Bcmchar.c: warning: format '%zd' expects argument of type 'signed size_t', but argument 2 has type 'ssize_t' [-Wformat]: => 146:3
+ drivers/staging/bcm/Bcmchar.c: warning: format '%zd' expects argument of type 'signed size_t', but argument 3 has type 'ssize_t' [-Wformat]: => 146:3
+ drivers/staging/ipack/bridges/tpci200.c: warning: assignment makes pointer from integer without a cast [enabled by default]: => 1048:16, 1017:17, 951:11, 1044:10
+ drivers/staging/media/easycap/easycap_main.c: warning: 'rc' may be used uninitialized in this function [-Wuninitialized]: => 3985:6
+ drivers/staging/ramster/cluster/tcp.c: warning: format '%zd' expects argument of type 'signed size_t', but argument 12 has type 'ssize_t' [-Wformat]: => 1003:3
+ drivers/staging/rts5139/rts51x.c: warning: 'rts51x_try_to_enter_ss' defined but not used [-Wunused-function]: => 204:13
+ drivers/staging/speakup/serialio.c: warning: statement with no effect [-Wunused-value]: => 114:2, 113:2, 115:2, 112:2
+ drivers/staging/speakup/synth.c: warning: suggest explicit braces to avoid ambiguous 'else' [-Wparentheses]: => 142:6
+ drivers/staging/vt6656/main_usb.c: warning: the frame size of 1872 bytes is larger than 1024 bytes [-Wframe-larger-than=]: => 2054:1
+ drivers/staging/wlags49_h2/hcf.c: warning: unused variable 'io_port' [-Wunused-variable]: => 4349:14, 3636:22
+ drivers/staging/wlags49_h25/../wlags49_h2/hcf.c: warning: unused variable 'io_port' [-Wunused-variable]: => 4349:14, 3636:22
+ drivers/staging/wlan-ng/prism2fw.c: warning: the frame size of 4228 bytes is larger than 1024 bytes [-Wframe-larger-than=]: => 1115:1
+ drivers/staging/wlan-ng/prism2fw.c: warning: the frame size of 4264 bytes is larger than 1024 bytes [-Wframe-larger-than=]: => 1115:1
+ drivers/staging/xgifb/vb_table.h: warning: (near initialization for 'XGI330_StandTable.CRTC') [-Wmissing-braces]: => 214:3
+ drivers/staging/xgifb/vb_table.h: warning: (near initialization for 'XGI330_StandTable.CRTC[1]') [enabled by default]: => 215:2, 218:3, 217:3, 216:3
+ drivers/staging/xgifb/vb_table.h: warning: (near initialization for 'XGI330_StandTable.CRTC[2]') [enabled by default]: => 219:2, 220:3, 221:3
+ drivers/staging/xgifb/vb_table.h: warning: (near initialization for 'XGI330_StandTable.CRTC[3]') [enabled by default]: => 223:3, 222:2
+ drivers/tty/serial/8250/8250.c: warning: statement with no effect [-Wunused-value]: => 2134:3
+ drivers/tty/serial/8250/serial_cs.c: warning: unused variable 'ctrl' [-Wunused-variable]: => 160:15
+ drivers/tty/serial/crisv10.c: warning: 'ser_interrupt' defined but not used [-Wunused-function]: => 2600:1
+ drivers/usb/gadget/f_hid.c: warning: format '%zd' expects argument of type 'signed size_t', but argument 3 has type 'ssize_t' [-Wformat]: => 233:3
+ drivers/usb/gadget/f_ncm.c: warning: 'tmp' may be used uninitialized in this function [-Wuninitialized]: 986:5, 1000:28, 1032:4, 1053:14, 1053:30 => 1032:13, 1073:6, 986:5, 1000:28, 1073:19, 1032:4, 1053:14, 1053:30
+ drivers/usb/gadget/inode.c: warning: format '%Zd' expects argument of type 'signed size_t', but argument 5 has type 'ssize_t' [-Wformat]: => 1924:21
+ drivers/usb/host/isp1362.h: warning: statement with no effect [-Wunused-value]: => 729:3
+ drivers/usb/misc/sisusbvga/sisusb.c: warning: format '%zd' expects argument of type 'signed size_t', but argument 3 has type 'ssize_t' [-Wformat]: => 982:7
+ drivers/usb/misc/sisusbvga/sisusb.c: warning: passing argument 7 of 'sisusb_write_mem_bulk' from incompatible pointer type [enabled by default]: => 1336:2
+ drivers/usb/misc/sisusbvga/sisusb_con.c: warning: passing argument 5 of 'sisusb_copy_memory' from incompatible pointer type [enabled by default]: => 996:4, 880:5, 554:5, 472:5, 985:4, 418:5, 991:4, 505:5, 664:5, 383:5
+ drivers/usb/musb/musb_io.h: warning: statement with no effect [-Wunused-value]: => 47:4, 45:4, 49:4
+ drivers/video/auo_k190x.c: warning: 'auok190x_resume' defined but not used [-Wunused-function]: => 726:12
+ drivers/video/auo_k190x.c: warning: 'auok190x_suspend' defined but not used [-Wunused-function]: => 686:12
+ drivers/virtio/virtio_mmio.c: warning: format '%u' expects argument of type 'unsigned int *', but argument 4 has type 'resource_size_t *' [-Wformat]: => 526:4
+ fs/9p/xattr.c: warning: format '%zd' expects argument of type 'signed size_t', but argument 4 has type 'ssize_t' [-Wformat]: => 35:3
+ fs/afs/internal.h: warning: 'packed' attribute ignored for field of type 'enum <anonymous>' [-Wattributes]: => 163:2
+ fs/afs/write.c: warning: format '%zd' expects argument of type 'signed size_t', but argument 4 has type 'ssize_t' [-Wformat]: => 653:2, 649:3
+ fs/befs/linuxvfs.c: warning: 'nlsname' may be used uninitialized in this function [-Wuninitialized]: => 259:10
+ fs/befs/linuxvfs.c: warning: 'nlsnamelen' may be used uninitialized in this function [-Wuninitialized]: => 259:10
+ fs/befs/linuxvfs.c: warning: 'utfname' may be used uninitialized in this function [-Wuninitialized]: => 184:7
+ fs/btrfs/backref.c: warning: 'type' may be used uninitialized in this function [-Wuninitialized]: => 1317:18
+ fs/btrfs/ctree.c: warning: 'pslot' may be used uninitialized in this function [-Wuninitialized]: => 1904:24, 1700:24
+ fs/btrfs/free-space-cache.c: warning: 'next_zero' may be used uninitialized in this function [-Wuninitialized]: => 2377:5
+ fs/btrfs/free-space-cache.c: warning: 'start' may be used uninitialized in this function [-Wuninitialized]: => 967:7
+ fs/btrfs/free-space-cache.c: warning: 'type' may be used uninitialized in this function [-Wuninitialized]: => 720:27
+ fs/btrfs/inode.c: warning: 'cow_start' may be used uninitialized in this function [-Wuninitialized]: => 1359:7
+ fs/btrfs/inode.c: warning: 'cur_offset' may be used uninitialized in this function [-Wuninitialized]: 1228:16 => 1377:31, 1254:16
+ fs/cifs/connect.c: warning: format '%zd' expects argument of type 'signed size_t', but argument 3 has type 'ssize_t' [-Wformat]: => 2524:3, 2516:3, 2534:3, 2509:3
+ fs/cifs/xattr.c: warning: format '%zd' expects argument of type 'signed size_t', but argument 3 has type 'ssize_t' [-Wformat]: => 322:5
+ fs/ecryptfs/crypto.c: warning: format '%zd' expects argument of type 'signed size_t', but argument 3 has type 'ssize_t' [-Wformat]: => 1513:11
+ fs/ecryptfs/keystore.c: warning: 'payload_len' may be used uninitialized in this function [-Wuninitialized]: => 1168:28
+ fs/ecryptfs/miscdev.c: warning: format '%zd' expects argument of type 'signed size_t', but argument 3 has type 'ssize_t' [-Wformat]: => 488:11, 448:10
+ fs/ext4/bitmap.c: warning: 'ext4_block_bitmap_csum_set' uses dynamic stack allocation [enabled by default]: => 114:1
+ fs/ext4/bitmap.c: warning: 'ext4_block_bitmap_csum_verify' uses dynamic stack allocation [enabled by default]: => 97:1
+ fs/ext4/bitmap.c: warning: 'ext4_inode_bitmap_csum_set' uses dynamic stack allocation [enabled by default]: => 70:1
+ fs/ext4/bitmap.c: warning: 'ext4_inode_bitmap_csum_verify' uses dynamic stack allocation [enabled by default]: => 53:1
+ fs/ext4/extents.c: warning: 'ext4_extent_block_csum' uses dynamic stack allocation [enabled by default]: => 65:1
+ fs/ext4/ialloc.c: warning: 'ext4_new_inode' uses dynamic stack allocation [enabled by default]: => 957:1
+ fs/ext4/inode.c: warning: 'ext4_iget' uses dynamic stack allocation [enabled by default]: => 3913:1
+ fs/ext4/inode.c: warning: 'ext4_inode_csum' uses dynamic stack allocation [enabled by default]: => 75:1
+ fs/ext4/inode.c: warning: format '%zd' expects argument of type 'signed size_t', but argument 6 has type 'ssize_t' [-Wformat]: => 2835:2
+ fs/ext4/mmp.c: warning: 'ext4_mmp_csum' uses dynamic stack allocation [enabled by default]: => 19:1
+ fs/ext4/namei.c: warning: 'ext4_dirent_csum' uses dynamic stack allocation [enabled by default]: => 249:1
+ fs/ext4/namei.c: warning: 'ext4_dx_csum' uses dynamic stack allocation [enabled by default]: => 345:1
+ fs/ext4/page-io.c: warning: format '%zd' expects argument of type 'signed size_t', but argument 6 has type 'ssize_t' [-Wformat]: => 107:5
+ fs/ext4/super.c: warning: 'ext4_fill_super' uses dynamic stack allocation [enabled by default]: => 3910:1
+ fs/ext4/super.c: warning: 'ext4_group_desc_csum' uses dynamic stack allocation [enabled by default]: => 2012:1
+ fs/ext4/super.c: warning: 'ext4_superblock_csum' uses dynamic stack allocation [enabled by default]: => 135:1
+ fs/ext4/xattr.c: warning: 'ext4_xattr_block_csum' uses dynamic stack allocation [enabled by default]: => 145:1
+ fs/fat/namei_vfat.c: warning: 'lcase' may be used uninitialized in this function [-Wuninitialized]: => 649:12
+ fs/freevxfs/vxfs_lookup.c: warning: 'pp' may be used uninitialized in this function [-Wuninitialized]: => 185:11
+ fs/fuse/control.c: warning: 'val' may be used uninitialized in this function [-Wuninitialized]: => 165:29, 128:23
+ fs/fuse/cuse.c: warning: 'key' may be used uninitialized in this function [-Wuninitialized]: => 279:36
+ fs/fuse/cuse.c: warning: 'val' may be used uninitialized in this function [-Wuninitialized]: => 286:372
+ fs/hfsplus/wrapper.c: warning: 'wd.ablk_size' may be used uninitialized in this function [-Wuninitialized]: => 213:16
+ fs/hfsplus/wrapper.c: warning: 'wd.ablk_start' may be used uninitialized in this function [-Wuninitialized]: => 214:17
+ fs/hfsplus/wrapper.c: warning: 'wd.embed_count' may be used uninitialized in this function [-Wuninitialized]: => 216:15
+ fs/hfsplus/wrapper.c: warning: 'wd.embed_start' may be used uninitialized in this function [-Wuninitialized]: => 215:11
+ fs/hpfs/alloc.c: warning: 'sec' may be used uninitialized in this function [-Wuninitialized]: => 206:29
+ fs/isofs/namei.c: warning: 'i' may be used uninitialized in this function [-Wuninitialized]: => 26:26
+ fs/jbd2/commit.c: warning: '__kunmap_atomic_deprecated' is deprecated (declared at /scratch/kisskb/src/include/linux/highmem.h:135) [-Wdeprecated-declarations]: => 357:1, 357:176
+ fs/jbd2/commit.c: warning: '__kunmap_atomic_deprecated' is deprecated (declared at /scratch/kisskb/src/include/linux/highmem.h:137): => 357
+ fs/jbd2/commit.c: warning: 'jbd2_block_tag_csum_set.isra.5' uses dynamic stack allocation [enabled by default]: => 360:1
+ fs/jbd2/commit.c: warning: 'jbd2_commit_block_csum_set' uses dynamic stack allocation [enabled by default]: => 104:1
+ fs/jbd2/commit.c: warning: 'jbd2_descr_block_csum_set' uses dynamic stack allocation [enabled by default]: => 339:1
+ fs/jbd2/commit.c: warning: 'kmap_atomic_deprecated' is deprecated (declared at /scratch/kisskb/src/include/linux/highmem.h:125) [-Wdeprecated-declarations]: => 352:2
+ fs/jbd2/commit.c: warning: 'kmap_atomic_deprecated' is deprecated (declared at /scratch/kisskb/src/include/linux/highmem.h:127): => 352
+ fs/jbd2/journal.c: warning: 'jbd2_journal_set_features' uses dynamic stack allocation [enabled by default]: => 1796:1
+ fs/jbd2/journal.c: warning: 'jbd2_superblock_csum' uses dynamic stack allocation [enabled by default]: => 119:1
+ fs/jbd2/journal.c: warning: 'journal_get_superblock' uses dynamic stack allocation [enabled by default]: => 1499:1
+ fs/jbd2/recovery.c: warning: 'jbd2_block_tag_csum_verify.isra.0' uses dynamic stack allocation [enabled by default]: => 411:1
+ fs/jbd2/recovery.c: warning: 'jbd2_commit_block_csum_verify' uses dynamic stack allocation [enabled by default]: => 394:1
+ fs/jbd2/recovery.c: warning: 'jbd2_descr_block_csum_verify' uses dynamic stack allocation [enabled by default]: => 195:1
+ fs/jbd2/recovery.c: warning: 'jbd2_revoke_block_csum_verify' uses dynamic stack allocation [enabled by default]: => 823:1
+ fs/jbd2/revoke.c: warning: 'jbd2_revoke_csum_set' uses dynamic stack allocation [enabled by default]: => 655:1
+ fs/locks.c: warning: 'lock' may be used uninitialized in this function [-Wuninitialized]: => 1675:17
+ fs/ncpfs/dir.c: warning: unused variable 'sb' [-Wunused-variable]: => 128:23
+ fs/ncpfs/ncp_fs_sb.h: warning: 'packed' attribute ignored for field of type '__u16' [-Wattributes]: => 130:4, 127:4, 129:4, 128:4, 126:4
+ fs/ncpfs/ncp_fs_sb.h: warning: 'packed' attribute ignored for field of type '__u32' [-Wattributes]: => 125:4, 124:4
+ fs/nfs/nfs4xdr.c: warning: the frame size of 1028 bytes is larger than 1024 bytes [-Wframe-larger-than=]: => 1747:1
+ fs/nilfs2/btree.c: warning: 'bh' may be used uninitialized in this function [-Wuninitialized]: => 1731:9
+ fs/nilfs2/recovery.c: warning: 'sum' may be used uninitialized in this function [-Wuninitialized]: => 908:22, 663:38
+ fs/ntfs/dir.c: warning: 'bmp_vi' may be used uninitialized in this function [-Wuninitialized]: => 1459:7
+ fs/ocfs2/cluster/tcp.c: warning: format '%zd' expects argument of type 'signed size_t', but argument 12 has type 'ssize_t' [-Wformat]: => 997:3
+ fs/ocfs2/dlmfs/dlmfs.c: warning: format '%zd' expects argument of type 'signed size_t', but argument 7 has type 'ssize_t' [-Wformat]: => 328:2, 284:2
+ fs/omfs/file.c: warning: 'remain' may be used uninitialized in this function [-Wuninitialized]: => 258:28
+ fs/quota/quota_tree.c: warning: format '%zd' expects argument of type 'signed size_t', but argument 4 has type 'ssize_t' [-Wformat]: => 372:4
+ fs/quota/quota_v2.c: warning: format '%zd' expects argument of type 'signed size_t', but argument 5 has type 'ssize_t' [-Wformat]: => 66:92
+ fs/xfs/xfs_alloc.c: warning: 'error' may be used uninitialized in this function [-Wuninitialized]: => 2051:6
+ fs/xfs/xfs_bmap.c: warning: 'error' may be used uninitialized in this function [-Wuninitialized]: => 3776:6, 5057:6, 3831:6
+ fs/xfs/xfs_dir2_block.c: warning: 'error' may be used uninitialized in this function [-Wuninitialized]: => 882:6
+ fs/xfs/xfs_rtalloc.c: warning: 'nrblocks' may be used uninitialized in this function [-Wuninitialized]: => 1938:97
+ include/linux/sysv_fs.h: warning: 'packed' attribute ignored for field of type '__fs32' [-Wattributes]: => 114:2, 181:2, 130:2, 43:2, 42:2, 30:2, 142:2, 100:2, 180:2, 168:2, 144:2, 112:2
+ include/linux/sysv_fs.h: warning: 'packed' attribute ignored for field of type 'sysv_zone_t[64]' [-Wattributes]: => 171:2
+ include/net/ipx.h: warning: 'packed' attribute ignored for field of type '__be16' [-Wattributes]: => 30:2, 32:2
+ include/net/ipx.h: warning: 'packed' attribute ignored for field of type 'struct ipx_address' [-Wattributes]: => 42:9, 41:9
+ kernel/cgroup.c: warning: integer overflow in expression [-Woverflow]: => 4172:32, 4172:21
+ kernel/sched/core.c: warning: unsupported argument to '__builtin_return_address' [enabled by default]: => 3105:51, 3103:50
+ kernel/signal.c: warning: cast from pointer to integer of different size [-Wpointer-to-int-cast]: 2707:1244, 2683:2561, 2683:1202, 2676:2634, 2676:1245, 2707:2633, 3074:2342, 3074:1073 => 2718:2633, 2687:2634, 2722:1223, 2718:1244, 3092:1073, 2722:2597, 2694:2561, 2687:1245, 3092:2342, 2694:1202
+ kernel/sys.c: warning: cast from pointer to integer of different size [-Wpointer-to-int-cast]: => 1980:2306, 1980:1057
+ lib/crc32.c: warning: unused variable 't4' [-Wunused-variable]: => 77:13
+ lib/crc32.c: warning: unused variable 't5' [-Wunused-variable]: => 77:27
+ lib/crc32.c: warning: unused variable 't6' [-Wunused-variable]: => 77:41
+ lib/crc32.c: warning: unused variable 't7' [-Wunused-variable]: => 77:55
+ lib/iomap.c: warning: statement with no effect [-Wunused-value]: => 205:154, 201:154, 197:154
+ mm/memcontrol.c: warning: 'thresholds' may be used uninitialized in this function [-Wuninitialized]: 4491:35, 4392:19, 4389:16 => 4435:32, 4314:16, 4317:19, 4417:35
+ mm/oom_kill.c: warning: 'points' may be used uninitialized in this function: => 693
+ mm/swapfile.c: warning: 'nr_extents' may be used uninitialized in this function [-Wuninitialized]: => 2090:1083
+ net/ceph/messenger.c: warning: 'proto' may be used uninitialized in this function [-Wuninitialized]: 726:38 => 733:38, 733:39
+ net/core/neighbour.c: warning: 'n2' may be used uninitialized in this function [-Wuninitialized]: => 1205:14
+ net/core/skbuff.c: warning: 'err' may be used uninitialized in this function [-Wuninitialized]: => 1258:6
+ net/ipv4/esp4.c: warning: 'net_adj' may be used uninitialized in this function [-Wuninitialized]: => 477:29
+ net/irda/irnet/irnet_ppp.c: warning: format '%Zd' expects argument of type 'signed size_t', but argument 3 has type 'ssize_t' [-Wformat]: => 334:7
+ net/nfc/llcp/llcp.c: warning: 'sn_len' may be used uninitialized in this function [-Wuninitialized]: => 576:100
+ net/sunrpc/auth_gss/auth_gss.c: warning: format '%Zd' expects argument of type 'signed size_t', but argument 2 has type 'ssize_t' [-Wformat]: => 684:2
+ net/sunrpc/auth_gss/auth_gss.c: warning: format '%zd' expects argument of type 'signed size_t', but argument 3 has type 'ssize_t' [-Wformat]: => 666:5
+ net/sunrpc/xprtsock.c: warning: format '%Zd' expects argument of type 'signed size_t', but argument 3 has type 'ssize_t' [-Wformat]: => 1205:2
+ sound/pcmcia/vx/vxp_ops.c: warning: unused variable 'port' [-Wunused-variable]: => 367:7
+ sound/soc/codecs/lm49453.c: warning: passing argument 3 of 'snd_soc_register_codec' discards 'const' qualifier from pointer target type [enabled by default]: => 1511:89, 1511:24
+ warning: CC kernel/ksysfs.o: => N/A
+ warning: CC [M] drivers/infiniband/core/verbs.o: => N/A
+ warning: CC [M] drivers/w1/masters/ds2482.o: => N/A
+ warning: CC [M] fs/nilfs2/namei.o: => N/A
+ warning: "cause_of_death" [vmlinux] is COMMON symbol: => N/A
+ warning: (DRM_RADEON_KMS && DRM_I915 && STUB_POULSBO && FB_BACKLIGHT && USB_APPLEDISPLAY && FB_OLPC_DCON && ASUS_LAPTOP && SONY_LAPTOP && THINKPAD_ACPI && EEEPC_LAPTOP && ACPI_CMPC && SAMSUNG_Q10 && APPLE_GMUX) selects BACKLIGHT_CLASS_DEVICE which has unmet direct dependencies (HAS_IOMEM && BACKLIGHT_LCD_SUPPORT): => N/A
+ warning: (LOCKDEP && FAULT_INJECTION_STACKTRACE_FILTER && LATENCYTOP && KMEMCHECK) selects FRAME_POINTER which has unmet direct dependencies (DEBUG_KERNEL && (CRIS || M68K || FRV || UML || AVR32 || SUPERH || BLACKFIN || MN10300) || ARCH_WANT_FRAME_POINTERS): => N/A
+ warning: (PPC_PS3 && PPC_CELLEB && USB_EHCI_HCD_PMC_MSP && XPS_USB_HCD_XILINX && USB_OCTEON_EHCI) selects USB_EHCI_BIG_ENDIAN_MMIO which has unmet direct dependencies (USB_SUPPORT && USB_EHCI_HCD && (PPC_CELLEB || PPC_PS3 || 440EPX || ARCH_IXP4XX || XPS_USB_HCD_XILINX || PPC_MPC512x || CPU_CAVIUM_OCTEON || PMC_MSP || SPARC_LEON || MIPS_SEAD3)): => N/A
+ warning: (PPC_PS3) selects USB_OHCI_LITTLE_ENDIAN which has unmet direct dependencies (USB_SUPPORT && USB_OHCI_HCD): => N/A
+ warning: (SPU_FS) selects MEMORY_HOTPLUG which has unmet direct dependencies ((SPARSEMEM || X86_64_ACPI_NUMA) && HOTPLUG && ARCH_ENABLE_MEMORY_HOTPLUG && (IA64 || X86 || PPC_BOOK3S_64 || SUPERH || S390)): => N/A
+ warning: arch/powerpc/platforms/built-in.o(.text+0x125f0): Section mismatch in reference from the function .pnv_pci_ioda_msi_setup() to the function .devinit.text:.__pnv_ioda_get_one_pe(): => N/A
+ warning: arch/powerpc/platforms/built-in.o(.text+0x1266c): Section mismatch in reference from the function .pnv_pci_ioda_msi_setup() to the function .devinit.text:.__pnv_ioda_get_one_pe(): => N/A
+ warning: arch/powerpc/platforms/built-in.o(.text+0x17f3c): Section mismatch in reference from the function .pci_dn_reconfig_notifier() to the function .devinit.text:.eeh_dev_init(): => N/A
+ warning: arch/powerpc/platforms/built-in.o(.text+0x17f5c): Section mismatch in reference from the function .pci_dn_reconfig_notifier() to the function .devinit.text:.eeh_dev_init(): => N/A
+ warning: arch/powerpc/platforms/powernv/built-in.o(.text+0x3838): Section mismatch in reference from the function .pnv_pci_ioda_msi_setup() to the function .devinit.text:.__pnv_ioda_get_one_pe(): => N/A
+ warning: arch/powerpc/platforms/powernv/built-in.o(.text+0x38b4): Section mismatch in reference from the function .pnv_pci_ioda_msi_setup() to the function .devinit.text:.__pnv_ioda_get_one_pe(): => N/A
+ warning: arch/powerpc/platforms/pseries/built-in.o(.text+0x43c0): Section mismatch in reference from the function .pci_dn_reconfig_notifier() to the function .devinit.text:.eeh_dev_init(): => N/A
+ warning: arch/powerpc/sysdev/built-in.o(.text+0x9e44): Section mismatch in reference from the function .ics_rtas_init() to the function .init.text:.xics_register_ics(): => N/A
+ warning: arch/powerpc/sysdev/xics/built-in.o(.text+0x18bc): Section mismatch in reference from the function .ics_rtas_init() to the function .init.text:.xics_register_ics(): => N/A
+ warning: drivers/built-in.o(.init.text+0x289cc): Section mismatch in reference from the function .libfcoe_init() to the function .exit.text:.fcoe_transport_exit(): => N/A
+ warning: drivers/built-in.o(.init.text+0x82d8): Section mismatch in reference from the function libfcoe_init() to the function .exit.text:fcoe_transport_exit(): => N/A
+ warning: drivers/iio/industrialio.o (.xt.lit): unexpected non-allocatable section.: => N/A
+ warning: drivers/iio/industrialio.o (.xt.prop): unexpected non-allocatable section.: => N/A
+ warning: drivers/infiniband/hw/nes/iw_nes.o (.xt.lit): unexpected non-allocatable section.: => N/A
+ warning: drivers/media/dvb/dvb-usb/dvb-usb-af9035.o (.xt.lit): unexpected non-allocatable section.: => N/A
+ warning: drivers/media/dvb/dvb-usb/dvb-usb-af9035.o (.xt.prop): unexpected non-allocatable section.: => N/A
+ warning: drivers/media/dvb/frontends/drxk.o (.xt.lit): unexpected non-allocatable section.: => N/A
+ warning: drivers/media/dvb/mantis/mantis_core.o (.xt.lit): unexpected non-allocatable section.: => N/A
+ warning: drivers/media/video/em28xx/em28xx-rc.o (.xt.lit): unexpected non-allocatable section.: => N/A
+ warning: drivers/media/video/em28xx/em28xx-rc.o (.xt.prop): unexpected non-allocatable section.: => N/A
+ warning: drivers/net/wireless/ti/wl1251/wl1251.o (.xt.lit): unexpected non-allocatable section.: => N/A
+ warning: drivers/net/wireless/ti/wl1251/wl1251.o (.xt.prop): unexpected non-allocatable section.: => N/A
+ warning: drivers/net/wireless/ti/wl1251/wl1251_sdio.o (.xt.lit): unexpected non-allocatable section.: => N/A
+ warning: drivers/net/wireless/ti/wl1251/wl1251_sdio.o (.xt.prop): unexpected non-allocatable section.: => N/A
+ warning: drivers/net/wireless/ti/wl1251/wl1251_spi.o (.xt.lit): unexpected non-allocatable section.: => N/A
+ warning: drivers/net/wireless/ti/wl1251/wl1251_spi.o (.xt.prop): unexpected non-allocatable section.: => N/A
+ warning: drivers/net/wireless/ti/wl12xx/wl12xx.o (.xt.lit): unexpected non-allocatable section.: => N/A
+ warning: drivers/net/wireless/ti/wl12xx/wl12xx.o (.xt.prop): unexpected non-allocatable section.: => N/A
+ warning: drivers/net/wireless/ti/wlcore/built-in.o (.xt.lit): unexpected non-allocatable section.: => N/A
+ warning: drivers/net/wireless/ti/wlcore/built-in.o (.xt.prop): unexpected non-allocatable section.: => N/A
+ warning: drivers/sbus/char/bbc.o(.devinit.text+0x8): Section mismatch in reference from the function bbc_i2c_probe() to the function .init.text:attach_one_i2c.constprop.0(): => N/A
+ warning: drivers/scsi/built-in.o(.init.text+0x1870): Section mismatch in reference from the function libfcoe_init() to the function .exit.text:fcoe_transport_exit(): => N/A
+ warning: drivers/scsi/built-in.o(.init.text+0x18cc): Section mismatch in reference from the function .libfcoe_init() to the function .exit.text:.fcoe_transport_exit(): => N/A
+ warning: drivers/scsi/fcoe/built-in.o(.init.text+0x598): Section mismatch in reference from the function .libfcoe_init() to the function .exit.text:.fcoe_transport_exit(): => N/A
+ warning: drivers/scsi/fcoe/built-in.o(.init.text+0x7c): Section mismatch in reference from the function libfcoe_init() to the function .exit.text:fcoe_transport_exit(): => N/A
+ warning: drivers/scsi/fcoe/built-in.o(.init.text+0x88): Section mismatch in reference from the function libfcoe_init() to the function .exit.text:fcoe_transport_exit(): => N/A
+ warning: drivers/scsi/fcoe/libfcoe.o(.init.literal+0x8): Section mismatch in reference from the (unknown reference) (unknown) to the function .exit.text:fcoe_transport_exit(): => N/A
+ warning: drivers/scsi/fcoe/libfcoe.o(.init.text+0x13): Section mismatch in reference from the function init_module() to the function .exit.text:fcoe_transport_exit(): => N/A
+ warning: drivers/scsi/fcoe/libfcoe.o(.init.text+0x20): Section mismatch in reference from the function init_module() to the function .exit.text:fcoe_transport_exit(): => N/A
+ warning: drivers/scsi/fcoe/libfcoe.o(.init.text+0x24): Section mismatch in reference from the function init_module() to the function .exit.text:fcoe_transport_exit(): => N/A
+ warning: drivers/scsi/fcoe/libfcoe.o(.init.text+0x30): Section mismatch in reference from the function init_module() to the function .exit.text:fcoe_transport_exit(): => N/A
+ warning: drivers/scsi/fcoe/libfcoe.o(.init.text+0x3a): Section mismatch in reference from the function init_module() to the function .exit.text:fcoe_transport_exit(): => N/A
+ warning: drivers/scsi/fcoe/libfcoe.o(.init.text+0x44): Section mismatch in reference from the function init_module() to the function .exit.text:fcoe_transport_exit(): => N/A
+ warning: drivers/scsi/fcoe/libfcoe.o(.init.text+0x64): Section mismatch in reference from the function .init_module() to the function .exit.text:.fcoe_transport_exit(): => N/A
+ warning: drivers/scsi/fcoe/libfcoe.o(.init.text+0x64): Section mismatch in reference from the function .libfcoe_init() to the function .exit.text:.fcoe_transport_exit(): => N/A
+ warning: drivers/scsi/fcoe/libfcoe.o(.init.text+0x7c): Section mismatch in reference from the function init_module() to the function .exit.text:fcoe_transport_exit(): => N/A
+ warning: drivers/scsi/fcoe/libfcoe.o(.init.text+0x7c): Section mismatch in reference from the function libfcoe_init() to the function .exit.text:fcoe_transport_exit(): => N/A
+ warning: drivers/scsi/fcoe/libfcoe.o(.init.text+0x88): Section mismatch in reference from the function init_module() to the function .exit.text:fcoe_transport_exit(): => N/A
+ warning: drivers/scsi/fcoe/libfcoe.o(.init.text+0x88): Section mismatch in reference from the function libfcoe_init() to the function .exit.text:fcoe_transport_exit(): => N/A
+ warning: drivers/spi/built-in.o(.devinit.text+0x1c20): Section mismatch in reference from the function rspi_probe() to the function .devexit.text:spidev_remove(): => N/A
+ warning: drivers/staging/gdm72xx/gdmwm.o (.xt.lit): unexpected non-allocatable section.: => N/A
+ warning: drivers/staging/gdm72xx/gdmwm.o (.xt.prop): unexpected non-allocatable section.: => N/A
+ warning: drivers/staging/ipack/bridges/tpci200.o(.data+0x28): Section mismatch in reference from the variable tpci200_pci_drv to the function .devexit.text:tpci200_pci_remove(): => N/A
+ warning: drivers/tty/serial/jsm/jsm.o (.xt.prop): unexpected non-allocatable section.: => N/A
+ warning: fs/lockd/lockd.o (.xt.lit): unexpected non-allocatable section.: => N/A
+ warning: make[3]: drivers/isdn/hardware/eicon/divas.o (.xt.lit): unexpected non-allocatable section.: => N/A
+ warning: net/irda/irda.o (.xt.lit): unexpected non-allocatable section.: => N/A
+ warning: net/mac802154/mac802154.o (.xt.lit): unexpected non-allocatable section.: => N/A
+ warning: net/mac802154/mac802154.o (.xt.prop): unexpected non-allocatable section.: => N/A
+ warning: net/nfc/hci/hci.o (.xt.lit): unexpected non-allocatable section.: => N/A
+ warning: net/nfc/hci/hci.o (.xt.prop): unexpected non-allocatable section.: => N/A
+ warning: net/nfc/nfc.o (.xt.lit): unexpected non-allocatable section.: => N/A
+ warning: size of symbol `sys_get_robust_list' changed from 8 in kernel/sys_ni.o to 348 in kernel/futex.o: => N/A
+ warning: sound/soc/generic/snd-soc-simple-card.o (.xt.lit): unexpected non-allocatable section.: => N/A
+ warning: sound/soc/generic/snd-soc-simple-card.o (.xt.prop): unexpected non-allocatable section.: => N/A
+ warning: vmlinux.o (.PPC.EMB.apuinfo): unexpected non-allocatable section.: => N/A
+ warning: vmlinux.o(.init.text+0x696ec): Section mismatch in reference from the function libfcoe_init() to the function .exit.text:fcoe_transport_exit(): => N/A
+ warning: vmlinux.o(.init.text+0xa3714): Section mismatch in reference from the function .libfcoe_init() to the function .exit.text:.fcoe_transport_exit(): => N/A
+ warning: vmlinux.o(.text+0x26ab0): Section mismatch in reference from the function .early_setup_secondary() to the function .cpuinit.text:.early_init_mmu_secondary(): => N/A
+ warning: vmlinux.o(.text+0x2c798): Section mismatch in reference from the function .early_setup_secondary() to the function .cpuinit.text:.early_init_mmu_secondary(): => N/A
+ warning: vmlinux.o(.text+0x4e65c): Section mismatch in reference from the function .wake_offline_cpus() to the function .cpuinit.text:.cpu_up(): => N/A
+ warning: vmlinux.o(.text+0x4fa78): Section mismatch in reference from the function .wake_offline_cpus() to the function .cpuinit.text:.cpu_up(): => N/A
+ warning: vmlinux.o(.text+0x5195c): Section mismatch in reference from the function .ics_rtas_init() to the function .init.text:.xics_register_ics(): => N/A
+ warning: vmlinux.o(.text+0x64630): Section mismatch in reference from the function .pnv_pci_ioda_msi_setup() to the function .devinit.text:.__pnv_ioda_get_one_pe(): => N/A
+ warning: vmlinux.o(.text+0x646ac): Section mismatch in reference from the function .pnv_pci_ioda_msi_setup() to the function .devinit.text:.__pnv_ioda_get_one_pe(): => N/A
+ warning: vmlinux.o(.text+0x7287c): Section mismatch in reference from the function .ics_rtas_init() to the function .init.text:.xics_register_ics(): => N/A
+ warning: vmlinux.o(.text+0x75224): Section mismatch in reference from the function .ics_rtas_init() to the function .init.text:.xics_register_ics(): => N/A
+ warning: vmlinux.o(.text+0x8671c): Section mismatch in reference from the function .pnv_pci_ioda_msi_setup() to the function .devinit.text:.__pnv_ioda_get_one_pe(): => N/A
+ warning: vmlinux.o(.text+0x86738): Section mismatch in reference from the function .pnv_pci_ioda_msi_setup() to the function .devinit.text:.__pnv_ioda_get_one_pe(): => N/A
+ warning: vmlinux.o(.text+0x890dc): Section mismatch in reference from the function .pnv_pci_ioda_msi_setup() to the function .devinit.text:.__pnv_ioda_get_one_pe(): => N/A
+ warning: vmlinux.o(.text+0x890f8): Section mismatch in reference from the function .pnv_pci_ioda_msi_setup() to the function .devinit.text:.__pnv_ioda_get_one_pe(): => N/A
+ warning: vmlinux.o(.text+0x8ae80): Section mismatch in reference from the function .pci_dn_reconfig_notifier() to the function .devinit.text:.update_dn_pci_info(): => N/A
+ warning: vmlinux.o(.text+0x8ae9c): Section mismatch in reference from the function .pci_dn_reconfig_notifier() to the function .devinit.text:.eeh_dev_init(): => N/A
+ warning: vmlinux.o(.text+0x8d840): Section mismatch in reference from the function .pci_dn_reconfig_notifier() to the function .devinit.text:.update_dn_pci_info(): => N/A
+ warning: vmlinux.o(.text+0x8d85c): Section mismatch in reference from the function .pci_dn_reconfig_notifier() to the function .devinit.text:.eeh_dev_init(): => N/A
+ warning: vmlinux.o(.text+0x8ffc8): Section mismatch in reference from the function .dlpar_online_cpu() to the function .cpuinit.text:.cpu_up(): => N/A
+ warning: vmlinux.o(.text+0x92988): Section mismatch in reference from the function .dlpar_online_cpu() to the function .cpuinit.text:.cpu_up(): => N/A
+ warning: vmlinux.o(.text+0x97b90): Section mismatch in reference from the function .pcibios_add_pci_devices() to the function .devinit.text:.of_rescan_bus(): => N/A
+ warning: vmlinux.o(.text+0x97c1c): Section mismatch in reference from the function .pcibios_add_pci_devices() to the function .devinit.text:.pcibios_setup_bus_devices(): => N/A
+ warning: vmlinux.o(.text+0x97c80): Section mismatch in reference from the function .pcibios_add_pci_devices() to the function .devinit.text:.pci_scan_bridge(): => N/A
+ warning: vmlinux.o(.text+0x9aadc): Section mismatch in reference from the function .pcibios_add_pci_devices() to the function .devinit.text:.of_rescan_bus(): => N/A
+ warning: vmlinux.o(.text+0x9ab68): Section mismatch in reference from the function .pcibios_add_pci_devices() to the function .devinit.text:.pcibios_setup_bus_devices(): => N/A
+ warning: vmlinux.o(.text+0x9abcc): Section mismatch in reference from the function .pcibios_add_pci_devices() to the function .devinit.text:.pci_scan_bridge(): => N/A

Gr{oetje,eeting}s,

Geert

--
Geert Uytterhoeven -- There's lots of Linux beyond ia32 -- ***@linux-m68k.org

In personal conversations with technical people, I call myself a hacker. But
when I'm talking to journalists I just say "programmer" or something like that.
-- Linus Torvalds
Geert Uytterhoeven
2012-06-26 20:06:27 UTC
Permalink
On Tue, Jun 26, 2012 at 9:59 PM, Geert Uytterhoeven
=C2=A0- build errors: +11/-219
11 regressions:
+ arch/sh/include/asm/fixmap.h: error: implicit declaration of
function 'BUG_ON' [-Werror=3Dimplicit-function-declaration]: =3D> 133:=
2
+ arch/sh/include/asm/thread_info.h: error: implicit declaration of
function 'WARN_ON' [-Werror=3Dimplicit-function-declaration]: =3D> 172=
:2
+ include/linux/huge_mm.h: error: implicit declaration of function
'BUG' [-Werror=3Dimplicit-function-declaration]: =3D> 185:2

shmin_defconfig, se7712_defconfig, se7721_defconfig, sh-allnoconfig

+ arch/x86/include/asm/paravirt.h: error: implicit declaration of
function 'BUG_ON' [-Werror=3Dimplicit-function-declaration]: =3D> 25:2
+ arch/x86/include/asm/processor.h: error: implicit declaration of
function 'WARN_ON_ONCE' [-Werror=3Dimplicit-function-declaration]: =3D=
936:2
+ arch/x86/include/asm/thread_info.h: error: implicit declaration of
function 'WARN_ON' [-Werror=3Dimplicit-function-declaration]: =3D> 251=
:2
+ include/linux/slub_def.h: error: implicit declaration of function
'BUG' [-Werror=3Dimplicit-function-declaration]: =3D> 192:2

i386-randconfig

+ error: of_platform.c: undefined reference to
`.pcibios_claim_one_bus': =3D> .devinit.text+0x160)

powerpc-randconfig

+ include/asm-generic/pgtable.h: error: implicit declaration of
function 'BUG' [-Werror=3Dimplicit-function-declaration]: =3D> 56:2
+ include/asm-generic/pgtable.h: error: implicit declaration of
function 'BUG': =3D> 56
+ include/linux/thread_info.h: error: implicit declaration of
function 'WARN_ON': =3D> 129

avr32-allnoconfig

Gr{oetje,eeting}s,

=C2=A0 =C2=A0 =C2=A0 =C2=A0 =C2=A0 =C2=A0 =C2=A0 =C2=A0 =C2=A0 =C2=A0 =C2=
=A0 =C2=A0 Geert

--
Geert Uytterhoeven -- There's lots of Linux beyond ia32 -- ***@linux-=
m68k.org

In personal conversations with technical people, I call myself a hacker=
=2E But
when I'm talking to journalists I just say "programmer" or something li=
ke that.
=C2=A0 =C2=A0 =C2=A0 =C2=A0 =C2=A0 =C2=A0 =C2=A0 =C2=A0 =C2=A0 =C2=A0 =C2=
=A0 =C2=A0 =C2=A0 =C2=A0=C2=A0 =C2=A0=C2=A0 -- Linus Torvalds
--
To unsubscribe from this list: send the line "unsubscribe linux-sh" in
the body of a message to ***@vger.kernel.org
More majordomo info at http://vger.kernel.org/majordomo-info.html
Michael Ellerman
2012-06-27 07:19:10 UTC
Permalink
Post by Geert Uytterhoeven
On Tue, Jun 26, 2012 at 9:59 PM, Geert Uytterhoeven
Post by Geert Uytterhoeven
- build errors: +11/-219
powerpc-randconfig
+ include/asm-generic/pgtable.h: error: implicit declaration of function 'BUG' [-Werror=implicit-function-declaration]: => 56:2
+ include/asm-generic/pgtable.h: error: implicit declaration of function 'BUG': => 56
+ include/linux/thread_info.h: error: implicit declaration of function 'WARN_ON': => 129
Fixed by 09682c1dd3820445a27d32dcbeee6a6eafff3dc9 AFAICS.

cheers

--
To unsubscribe from this list: send the line "unsubscribe linux-sh" in
the body of a message to ***@vger.kernel.org
More majordomo info at http://vger.kernel.org/majordomo-info.html
Geert Uytterhoeven
2012-06-29 16:36:53 UTC
Permalink
Hi Paul,
Post by Geert Uytterhoeven
On Tue, Jun 26, 2012 at 9:59 PM, Geert Uytterhoeven
??- build errors: +11/-219
=C2=A0 + arch/sh/include/asm/fixmap.h: error: implicit declaration o=
f
Post by Geert Uytterhoeven
function 'BUG_ON' [-Werror=3Dimplicit-function-declaration]: =C2=A0=3D=
133:2
Post by Geert Uytterhoeven
=C2=A0 + arch/sh/include/asm/thread_info.h: error: implicit declarat=
ion of
Post by Geert Uytterhoeven
function 'WARN_ON' [-Werror=3Dimplicit-function-declaration]: =C2=A0=
=3D> 172:2
Post by Geert Uytterhoeven
=C2=A0 + include/linux/huge_mm.h: error: implicit declaration of fun=
ction
Post by Geert Uytterhoeven
'BUG' [-Werror=3Dimplicit-function-declaration]: =C2=A0=3D> 185:2
shmin_defconfig, se7712_defconfig, se7721_defconfig, sh-allnoconfig
I'm unable to reproduce any of these, is there some specific compiler
version or warning flag configuration I'm supposed to be using? I'm
building with 4.5.1 at the moment.
Mine (from Tony) is:

sh4-linux-gcc -v
Using built-in specs.
COLLECT_GCC=3D/usr/local/gcc-4.6.3-nolibc/sh4-linux/bin/sh4-linux-gcc
COLLECT_LTO_WRAPPER=3D/usr/local/gcc-4.6.3-nolibc/sh4-linux/bin/../libe=
xec/gcc/sh4-linux/4.6.3/lto-wrapper
Target: sh4-linux
Configured with: /home/tony/buildall/src/gcc/configure
--target=3Dsh4-linux --host=3Dx86_64-linux-gnu --build=3Dx86_64-linux-g=
nu
--enable-targets=3Dall --prefix=3D/opt/cross/gcc-4.6.3-nolibc/sh4-linux=
/
--enable-languages=3Dc --with-newlib --without-headers --disable-nls
--disable-threads --disable-shared --disable-libmudflap
--disable-libssp --disable-libgomp --disable-decimal-float
--enable-checking=3Drelease --with-multilib-list=3Dm4,m4-nofpu
--with-mpfr=3D/home/tony/buildall/src/sys-x86_64
--with-gmp=3D/home/tony/buildall/src/sys-x86_64 --disable-bootstrap
--disable-libquadmath
Thread model: single
gcc version 4.6.3 (GCC)

Using v3.5-rc4:

se7721_defconfig:

sh4-linux-gcc -Wp,-MD,arch/sh/kernel/.asm-offsets.s.d -nostdinc
-isystem /usr/local/gcc-4.6.3-nolibc/sh4-linux/bin/../lib/gcc/sh4-linux=
/4.6.3/include
-Iarch/sh/include -Iarch/sh/include/generated -Iinclude -include
include/linux/kconfig.h -D__KERNEL__ -m4-nofpu -ml -Wa,-isa=3Dany
-ffreestanding -Iarch/sh/include/cpu-sh3 -Iarch/sh/include/cpu-common
-Iarch/sh/include/mach-se -Iarch/sh/include/mach-common -Wall -Wundef
-Wstrict-prototypes -Wno-trigraphs -fno-strict-aliasing -fno-common
-Werror-implicit-function-declaration -Wno-format-security
-fno-delete-null-pointer-checks -O2 -pipe -m4-nofpu -ml -Wa,-isa=3Dany
-ffreestanding -Iarch/sh/include/cpu-sh3 -Iarch/sh/include/cpu-common
-Iarch/sh/include/mach-se -Iarch/sh/include/mach-common
-Wframe-larger-than=3D1024 -fno-stack-protector
-Wno-unused-but-set-variable -fno-omit-frame-pointer
-fno-optimize-sibling-calls -g -Wdeclaration-after-statement
-Wno-pointer-sign -fno-strict-overflow -fconserve-stack
-DCC_HAVE_ASM_GOTO -D"KBUILD_STR(s)=3D#s"
-D"KBUILD_BASENAME=3DKBUILD_STR(asm_offsets)"
-D"KBUILD_MODNAME=3DKBUILD_STR(asm_offsets)" -fverbose-asm -S -o
arch/sh/kernel/asm-offsets.s arch/sh/kernel/asm-offsets.c
In file included from include/linux/thread_info.h:54:0,
from include/linux/preempt.h:9,
from include/linux/spinlock.h:50,
from include/linux/mmzone.h:7,
from include/linux/gfp.h:4,
from include/linux/mm.h:8,
from arch/sh/kernel/asm-offsets.c:13:
arch/sh/include/asm/thread_info.h: In function 'set_restore_sigmask':
arch/sh/include/asm/thread_info.h:172:2: error: implicit declaration
of function 'WARN_ON' [-Werror=3Dimplicit-function-declaration]
In file included from arch/sh/include/asm/pgtable.h:25:0,
from include/linux/mm.h:44,
from arch/sh/kernel/asm-offsets.c:13:
arch/sh/include/asm/fixmap.h: In function 'virt_to_fix':
arch/sh/include/asm/fixmap.h:133:2: error: implicit declaration of
function 'BUG_ON' [-Werror=3Dimplicit-function-declaration]
In file included from arch/sh/include/asm/pgtable.h:164:0,
from include/linux/mm.h:44,
from arch/sh/kernel/asm-offsets.c:13:
include/asm-generic/pgtable.h: In function 'pmdp_test_and_clear_young':
include/asm-generic/pgtable.h:56:2: error: implicit declaration of
function 'BUG' [-Werror=3Dimplicit-function-declaration]
cc1: some warnings being treated as errors
make[1]: *** [arch/sh/kernel/asm-offsets.s] Error 1


allnoconfig:

sh4-linux-gcc -Wp,-MD,arch/sh/kernel/.asm-offsets.s.d -nostdinc
-isystem /usr/local/gcc-4.6.3-nolibc/sh4-linux/bin/../lib/gcc/sh4-linux=
/4.6.3/include
-Iarch/sh/include -Iarch/sh/include/generated -Iinclude -include
include/linux/kconfig.h -D__KERNEL__ -m4-nofpu -ml -Wa,-isa=3Dany
-ffreestanding -Iarch/sh/include/cpu-sh2 -Iarch/sh/include/cpu-common
-Iarch/sh/include/mach-common -Wall -Wundef -Wstrict-prototypes
-Wno-trigraphs -fno-strict-aliasing -fno-common
-Werror-implicit-function-declaration -Wno-format-security
-fno-delete-null-pointer-checks -O2 -pipe -m4-nofpu -ml -Wa,-isa=3Dany
-ffreestanding -Iarch/sh/include/cpu-sh2 -Iarch/sh/include/cpu-common
-Iarch/sh/include/mach-common -Wframe-larger-than=3D1024
-fno-stack-protector -Wno-unused-but-set-variable -fomit-frame-pointer
-Wdeclaration-after-statement -Wno-pointer-sign -fno-strict-overflow
-fconserve-stack -DCC_HAVE_ASM_GOTO -D"KBUILD_STR(s)=3D#s"
-D"KBUILD_BASENAME=3DKBUILD_STR(asm_offsets)"
-D"KBUILD_MODNAME=3DKBUILD_STR(asm_offsets)" -fverbose-asm -S -o
arch/sh/kernel/asm-offsets.s arch/sh/kernel/asm-offsets.c
In file included from include/linux/thread_info.h:54:0,
from include/linux/preempt.h:9,
from include/linux/spinlock.h:50,
from include/linux/mmzone.h:7,
from include/linux/gfp.h:4,
from include/linux/mm.h:8,
from arch/sh/kernel/asm-offsets.c:13:
arch/sh/include/asm/thread_info.h: In function 'set_restore_sigmask':
arch/sh/include/asm/thread_info.h:172:2: error: implicit declaration
of function 'WARN_ON' [-Werror=3Dimplicit-function-declaration]
In file included from arch/sh/include/asm/pgtable.h:25:0,
from include/linux/mm.h:44,
from arch/sh/kernel/asm-offsets.c:13:
arch/sh/include/asm/fixmap.h: In function 'virt_to_fix':
arch/sh/include/asm/fixmap.h:133:2: error: implicit declaration of
function 'BUG_ON' [-Werror=3Dimplicit-function-declaration]
In file included from include/linux/mm.h:257:0,
from arch/sh/kernel/asm-offsets.c:13:
include/linux/huge_mm.h: In function 'hugepage_madvise':
include/linux/huge_mm.h:185:2: error: implicit declaration of function
'BUG' [-Werror=3Dimplicit-function-declaration]
cc1: some warnings being treated as errors
make[1]: *** [arch/sh/kernel/asm-offsets.s] Error 1

Gr{oetje,eeting}s,

=C2=A0 =C2=A0 =C2=A0 =C2=A0 =C2=A0 =C2=A0 =C2=A0 =C2=A0 =C2=A0 =C2=A0 =C2=
=A0 =C2=A0 Geert

--
Geert Uytterhoeven -- There's lots of Linux beyond ia32 -- ***@linux-=
m68k.org

In personal conversations with technical people, I call myself a hacker=
=2E But
when I'm talking to journalists I just say "programmer" or something li=
ke that.
=C2=A0 =C2=A0 =C2=A0 =C2=A0 =C2=A0 =C2=A0 =C2=A0 =C2=A0 =C2=A0 =C2=A0 =C2=
=A0 =C2=A0 =C2=A0 =C2=A0=C2=A0 =C2=A0=C2=A0 -- Linus Torvalds
--
To unsubscribe from this list: send the line "unsubscribe linux-sh" in
the body of a message to ***@vger.kernel.org
More majordomo info at http://vger.kernel.org/majordomo-info.html
Geert Uytterhoeven
2012-07-13 20:02:47 UTC
Permalink
On Tue, Jun 26, 2012 at 9:59 PM, Geert Uytterhoeven
Post by Geert Uytterhoeven
+ drivers/i2c/busses/i2c-bfin-twi.c: error: 'ANAK' undeclared (first use in this function): => 154:19
+ drivers/i2c/busses/i2c-bfin-twi.c: error: 'BUFRDERR' undeclared (first use in this function): => 158:19
+ drivers/i2c/busses/i2c-bfin-twi.c: error: 'BUFWRERR' undeclared (first use in this function): => 160:19
+ drivers/i2c/busses/i2c-bfin-twi.c: error: 'BUSBUSY' undeclared (first use in this function): => 401:35, 301:35
+ drivers/i2c/busses/i2c-bfin-twi.c: error: 'DNAK' undeclared (first use in this function): => 156:19
+ drivers/i2c/busses/i2c-bfin-twi.c: error: 'FAST' undeclared (first use in this function): => 511:17, 360:18
+ drivers/i2c/busses/i2c-bfin-twi.c: error: 'LOSTARB' undeclared (first use in this function): => 152:19
+ drivers/i2c/busses/i2c-bfin-twi.c: error: 'MCOMP' undeclared (first use in this function): => 189:22, 489:31, 344:31
+ drivers/i2c/busses/i2c-bfin-twi.c: error: 'MDIR' undeclared (first use in this function): => 359:31, 567:32, 102:30
+ drivers/i2c/busses/i2c-bfin-twi.c: error: 'MEN' undeclared (first use in this function): => 358:51, 510:52, 196:33
+ drivers/i2c/busses/i2c-bfin-twi.c: error: 'MERR' undeclared (first use in this function): => 146:23, 489:24, 344:24
+ drivers/i2c/busses/i2c-bfin-twi.c: error: 'RCVSERV' undeclared (first use in this function): => 489:49, 116:23, 344:49
+ drivers/i2c/busses/i2c-bfin-twi.c: error: 'RSTART' undeclared (first use in this function): => 102:37
+ drivers/i2c/busses/i2c-bfin-twi.c: error: 'SCLOVR' undeclared (first use in this function): => 171:29
+ drivers/i2c/busses/i2c-bfin-twi.c: error: 'SDAOVR' undeclared (first use in this function): => 177:28
+ drivers/i2c/busses/i2c-bfin-twi.c: error: 'SDASEN' undeclared (first use in this function): => 168:33
+ drivers/i2c/busses/i2c-bfin-twi.c: error: 'STOP' undeclared (first use in this function): => 105:30
+ drivers/i2c/busses/i2c-bfin-twi.c: error: 'TWI_ENA' undeclared (first use in this function): => 398:30, 624:47, 298:30, 725:45
+ drivers/i2c/busses/i2c-bfin-twi.c: error: 'XMTSERV' undeclared (first use in this function): => 344:39, 489:39, 90:23
This seems to be caused by commit c55c89e939f2a0a83d5c61462be554d5d2408178
("blackfin: twi: move twi bit mask macro to twi head file").
However, just including <asm/bfin_twi.h> doesn't fix it, as commit
1e92bf6d80b5a0a137455c96bf6cdd9c1a5b531e ("blackfin: twi: Move TWI MMR access
macro to twi head file") created lots of duplicate definitions:

arch/blackfin/include/asm/bfin_twi.h:87:6: warning: "ANOMALY_05001001"
is not defined [-Wundef]
arch/blackfin/include/asm/bfin_twi.h:67:0: note: this is the location
of the previous definition
drivers/i2c/busses/i2c-bfin-twi.c:36:8: error: redefinition of 'struct
bfin_twi_iface'
arch/blackfin/include/asm/bfin_twi.h:46:8: note: originally defined here
arch/blackfin/include/asm/bfin_twi.h:73:90: note: previous definition
of 'read_CLKDIV' was here
arch/blackfin/include/asm/bfin_twi.h:73:259: note: previous definition
of 'write_CLKDIV' was here
arch/blackfin/include/asm/bfin_twi.h:74:90: note: previous definition
of 'read_CONTROL' was here
arch/blackfin/include/asm/bfin_twi.h:74:261: note: previous definition
of 'write_CONTROL' was here
arch/blackfin/include/asm/bfin_twi.h:75:90: note: previous definition
of 'read_SLAVE_CTL' was here
arch/blackfin/include/asm/bfin_twi.h:75:265: note: previous definition
of 'write_SLAVE_CTL' was here
arch/blackfin/include/asm/bfin_twi.h:76:90: note: previous definition
of 'read_SLAVE_STAT' was here
arch/blackfin/include/asm/bfin_twi.h:76:267: note: previous definition
of 'write_SLAVE_STAT' was here
arch/blackfin/include/asm/bfin_twi.h:77:90: note: previous definition
of 'read_SLAVE_ADDR' was here
arch/blackfin/include/asm/bfin_twi.h:77:267: note: previous definition
of 'write_SLAVE_ADDR' was here
arch/blackfin/include/asm/bfin_twi.h:78:90: note: previous definition
of 'read_MASTER_CTL' was here
arch/blackfin/include/asm/bfin_twi.h:78:267: note: previous definition
of 'write_MASTER_CTL' was here
arch/blackfin/include/asm/bfin_twi.h:79:90: note: previous definition
of 'read_MASTER_STAT' was here
arch/blackfin/include/asm/bfin_twi.h:79:269: note: previous definition
of 'write_MASTER_STAT' was here
arch/blackfin/include/asm/bfin_twi.h:80:90: note: previous definition
of 'read_MASTER_ADDR' was here
arch/blackfin/include/asm/bfin_twi.h:80:269: note: previous definition
of 'write_MASTER_ADDR' was here
arch/blackfin/include/asm/bfin_twi.h:81:90: note: previous definition
of 'read_INT_STAT' was here
arch/blackfin/include/asm/bfin_twi.h:81:263: note: previous definition
of 'write_INT_STAT' was here
arch/blackfin/include/asm/bfin_twi.h:82:90: note: previous definition
of 'read_INT_MASK' was here
arch/blackfin/include/asm/bfin_twi.h:82:263: note: previous definition
of 'write_INT_MASK' was here
arch/blackfin/include/asm/bfin_twi.h:83:90: note: previous definition
of 'read_FIFO_CTL' was here
arch/blackfin/include/asm/bfin_twi.h:83:263: note: previous definition
of 'write_FIFO_CTL' was here
arch/blackfin/include/asm/bfin_twi.h:84:90: note: previous definition
of 'read_FIFO_STAT' was here
arch/blackfin/include/asm/bfin_twi.h:84:265: note: previous definition
of 'write_FIFO_STAT' was here
arch/blackfin/include/asm/bfin_twi.h:85:90: note: previous definition
of 'read_XMT_DATA8' was here
arch/blackfin/include/asm/bfin_twi.h:85:265: note: previous definition
of 'write_XMT_DATA8' was here
arch/blackfin/include/asm/bfin_twi.h:86:90: note: previous definition
of 'read_XMT_DATA16' was here
arch/blackfin/include/asm/bfin_twi.h:86:267: note: previous definition
of 'write_XMT_DATA16' was here
arch/blackfin/include/asm/bfin_twi.h:88:90: note: previous definition
of 'read_RCV_DATA8' was here
arch/blackfin/include/asm/bfin_twi.h:88:265: note: previous definition
of 'write_RCV_DATA8' was here
arch/blackfin/include/asm/bfin_twi.h:89:90: note: previous definition
of 'read_RCV_DATA16' was here
arch/blackfin/include/asm/bfin_twi.h:89:267: note: previous definition
of 'write_RCV_DATA16' was here

So I gave up. A pity, considering BF537-STAMP_defconfig is the only
blackfin config
in http://kisskb.ellerman.id.au/kisskb/branch/3/.

Gr{oetje,eeting}s,

Geert

--
Geert Uytterhoeven -- There's lots of Linux beyond ia32 -- ***@linux-m68k.org

In personal conversations with technical people, I call myself a hacker. But
when I'm talking to journalists I just say "programmer" or something like that.
-- Linus Torvalds
Bob Liu
2012-07-16 02:44:29 UTC
Permalink
Hi Geert,

On Sat, Jul 14, 2012 at 4:02 AM, Geert Uytterhoeven
Post by Geert Uytterhoeven
On Tue, Jun 26, 2012 at 9:59 PM, Geert Uytterhoeven
Post by Geert Uytterhoeven
+ drivers/i2c/busses/i2c-bfin-twi.c: error: 'ANAK' undeclared (first use in this function): => 154:19
+ drivers/i2c/busses/i2c-bfin-twi.c: error: 'BUFRDERR' undeclared (first use in this function): => 158:19
+ drivers/i2c/busses/i2c-bfin-twi.c: error: 'BUFWRERR' undeclared (first use in this function): => 160:19
+ drivers/i2c/busses/i2c-bfin-twi.c: error: 'BUSBUSY' undeclared (first use in this function): => 401:35, 301:35
+ drivers/i2c/busses/i2c-bfin-twi.c: error: 'DNAK' undeclared (first use in this function): => 156:19
+ drivers/i2c/busses/i2c-bfin-twi.c: error: 'FAST' undeclared (first use in this function): => 511:17, 360:18
+ drivers/i2c/busses/i2c-bfin-twi.c: error: 'LOSTARB' undeclared (first use in this function): => 152:19
+ drivers/i2c/busses/i2c-bfin-twi.c: error: 'MCOMP' undeclared (first use in this function): => 189:22, 489:31, 344:31
+ drivers/i2c/busses/i2c-bfin-twi.c: error: 'MDIR' undeclared (first use in this function): => 359:31, 567:32, 102:30
+ drivers/i2c/busses/i2c-bfin-twi.c: error: 'MEN' undeclared (first use in this function): => 358:51, 510:52, 196:33
+ drivers/i2c/busses/i2c-bfin-twi.c: error: 'MERR' undeclared (first use in this function): => 146:23, 489:24, 344:24
+ drivers/i2c/busses/i2c-bfin-twi.c: error: 'RCVSERV' undeclared (first use in this function): => 489:49, 116:23, 344:49
+ drivers/i2c/busses/i2c-bfin-twi.c: error: 'RSTART' undeclared (first use in this function): => 102:37
+ drivers/i2c/busses/i2c-bfin-twi.c: error: 'SCLOVR' undeclared (first use in this function): => 171:29
+ drivers/i2c/busses/i2c-bfin-twi.c: error: 'SDAOVR' undeclared (first use in this function): => 177:28
+ drivers/i2c/busses/i2c-bfin-twi.c: error: 'SDASEN' undeclared (first use in this function): => 168:33
+ drivers/i2c/busses/i2c-bfin-twi.c: error: 'STOP' undeclared (first use in this function): => 105:30
+ drivers/i2c/busses/i2c-bfin-twi.c: error: 'TWI_ENA' undeclared (first use in this function): => 398:30, 624:47, 298:30, 725:45
+ drivers/i2c/busses/i2c-bfin-twi.c: error: 'XMTSERV' undeclared (first use in this function): => 344:39, 489:39, 90:23
This seems to be caused by commit c55c89e939f2a0a83d5c61462be554d5d2408178
("blackfin: twi: move twi bit mask macro to twi head file").
However, just including <asm/bfin_twi.h> doesn't fix it, as commit
1e92bf6d80b5a0a137455c96bf6cdd9c1a5b531e ("blackfin: twi: Move TWI MMR access
arch/blackfin/include/asm/bfin_twi.h:87:6: warning: "ANOMALY_05001001"
is not defined [-Wundef]
arch/blackfin/include/asm/bfin_twi.h:67:0: note: this is the location
of the previous definition
drivers/i2c/busses/i2c-bfin-twi.c:36:8: error: redefinition of 'struct
bfin_twi_iface'
arch/blackfin/include/asm/bfin_twi.h:46:8: note: originally defined here
arch/blackfin/include/asm/bfin_twi.h:73:90: note: previous definition
of 'read_CLKDIV' was here
arch/blackfin/include/asm/bfin_twi.h:73:259: note: previous definition
of 'write_CLKDIV' was here
arch/blackfin/include/asm/bfin_twi.h:74:90: note: previous definition
of 'read_CONTROL' was here
arch/blackfin/include/asm/bfin_twi.h:74:261: note: previous definition
of 'write_CONTROL' was here
arch/blackfin/include/asm/bfin_twi.h:75:90: note: previous definition
of 'read_SLAVE_CTL' was here
arch/blackfin/include/asm/bfin_twi.h:75:265: note: previous definition
of 'write_SLAVE_CTL' was here
arch/blackfin/include/asm/bfin_twi.h:76:90: note: previous definition
of 'read_SLAVE_STAT' was here
arch/blackfin/include/asm/bfin_twi.h:76:267: note: previous definition
of 'write_SLAVE_STAT' was here
arch/blackfin/include/asm/bfin_twi.h:77:90: note: previous definition
of 'read_SLAVE_ADDR' was here
arch/blackfin/include/asm/bfin_twi.h:77:267: note: previous definition
of 'write_SLAVE_ADDR' was here
arch/blackfin/include/asm/bfin_twi.h:78:90: note: previous definition
of 'read_MASTER_CTL' was here
arch/blackfin/include/asm/bfin_twi.h:78:267: note: previous definition
of 'write_MASTER_CTL' was here
arch/blackfin/include/asm/bfin_twi.h:79:90: note: previous definition
of 'read_MASTER_STAT' was here
arch/blackfin/include/asm/bfin_twi.h:79:269: note: previous definition
of 'write_MASTER_STAT' was here
arch/blackfin/include/asm/bfin_twi.h:80:90: note: previous definition
of 'read_MASTER_ADDR' was here
arch/blackfin/include/asm/bfin_twi.h:80:269: note: previous definition
of 'write_MASTER_ADDR' was here
arch/blackfin/include/asm/bfin_twi.h:81:90: note: previous definition
of 'read_INT_STAT' was here
arch/blackfin/include/asm/bfin_twi.h:81:263: note: previous definition
of 'write_INT_STAT' was here
arch/blackfin/include/asm/bfin_twi.h:82:90: note: previous definition
of 'read_INT_MASK' was here
arch/blackfin/include/asm/bfin_twi.h:82:263: note: previous definition
of 'write_INT_MASK' was here
arch/blackfin/include/asm/bfin_twi.h:83:90: note: previous definition
of 'read_FIFO_CTL' was here
arch/blackfin/include/asm/bfin_twi.h:83:263: note: previous definition
of 'write_FIFO_CTL' was here
arch/blackfin/include/asm/bfin_twi.h:84:90: note: previous definition
of 'read_FIFO_STAT' was here
arch/blackfin/include/asm/bfin_twi.h:84:265: note: previous definition
of 'write_FIFO_STAT' was here
arch/blackfin/include/asm/bfin_twi.h:85:90: note: previous definition
of 'read_XMT_DATA8' was here
arch/blackfin/include/asm/bfin_twi.h:85:265: note: previous definition
of 'write_XMT_DATA8' was here
arch/blackfin/include/asm/bfin_twi.h:86:90: note: previous definition
of 'read_XMT_DATA16' was here
arch/blackfin/include/asm/bfin_twi.h:86:267: note: previous definition
of 'write_XMT_DATA16' was here
arch/blackfin/include/asm/bfin_twi.h:88:90: note: previous definition
of 'read_RCV_DATA8' was here
arch/blackfin/include/asm/bfin_twi.h:88:265: note: previous definition
of 'write_RCV_DATA8' was here
arch/blackfin/include/asm/bfin_twi.h:89:90: note: previous definition
of 'read_RCV_DATA16' was here
arch/blackfin/include/asm/bfin_twi.h:89:267: note: previous definition
of 'write_RCV_DATA16' was here
So I gave up. A pity, considering BF537-STAMP_defconfig is the only
blackfin config
in http://kisskb.ellerman.id.au/kisskb/branch/3/.
Gr{oetje,eeting}s,
Geert
The fix patches have already in Wolfram Sang's i2c tree, i think it'll
be merged soon.
--
Regards,
--Bob
Geert Uytterhoeven
2012-07-16 07:02:40 UTC
Permalink
Hi Bob,
Post by Bob Liu
On Sat, Jul 14, 2012 at 4:02 AM, Geert Uytterhoeven
Post by Geert Uytterhoeven
On Tue, Jun 26, 2012 at 9:59 PM, Geert Uytterhoeven
Post by Geert Uytterhoeven
+ drivers/i2c/busses/i2c-bfin-twi.c: error: 'ANAK' undeclared (first use in this function): => 154:19
+ drivers/i2c/busses/i2c-bfin-twi.c: error: 'XMTSERV' undeclared (first use in this function): => 344:39, 489:39, 90:23
The fix patches have already in Wolfram Sang's i2c tree, i think it'll
be merged soon.
Thanks, good to hear that!

Gr{oetje,eeting}s,

Geert

--
Geert Uytterhoeven -- There's lots of Linux beyond ia32 -- ***@linux-m68k.org

In personal conversations with technical people, I call myself a hacker. But
when I'm talking to journalists I just say "programmer" or something like that.
-- Linus Torvalds

Continue reading on narkive:
Loading...